2H-Pyran-2-carboxaldehyde, 3,4-dihydro-
- Formula: C6H8O2
- Molecular weight: 112.1265
- IUPAC Standard InChIKey: NPWYTMFWRRIFLK-UHFFFAOYSA-N
- CAS Registry Number: 100-73-2
- Chemical structure:
View 3d structure (requires JavaScript / HTML 5) - Other names: Acrolein dimer; 2-Propenal dimer; 5-Hexenal, 2,6-epoxy-; Pyran aldehyde; 2-Formyl-3,4-dihydro-2H-pyran; 3,4-Dihydro-2H-pyran-2-carboxaldehyde; 2,3-Dihydro-1,4-pyran-2-karboxaldehyd; 3,4-Dihydro-2-carboxaldehyde-2H-pyran; 3,4-Dihydro-2-formyl-2H-pyran; NSC 95413; Acroleine dimer; 3,4-dihydro-2H-pyran-2-carbaldehyde

Normal alkane RI, non-polar column, temperature ramp

Column type | Active phase | I | Reference | Comment |
---|---|---|---|---|
Capillary | OV-101 | 853. | Zenkevich, 2005 | 25. m/0.20 mm/0.10 μm, N2/He, 6. K/min; Tstart: 50. C; Tend: 250. C |

References

Zenkevich, 2005
Zenkevich, I.G.,
Experimentally measured retention indices., 2005. [all data]