2H-Pyran-2-methanol, tetrahydro-
- Formula: C6H12O2
- Molecular weight: 116.1583
- IUPAC Standard InChIKey: ROTONRWJLXYJBD-UHFFFAOYSA-N
- CAS Registry Number: 100-72-1
- Chemical structure:
View 3d structure (requires JavaScript / HTML 5) - Other names: Tetrahydropyran-2-carbinol; Tetrahydropyran-2-methanol; Tetrahydropyranyl-2-methanol; 2-(Hydroxymethyl)tetrahydropyran; Pyran-2-methanol, tetrahydro-; 2-Methanol, tetrahydropyran; 2-Methyloltetrahydro-1,4-pyran; 2-Tetrahydropyranilcarbinol; Tetrahydro-2H-pyran-2-methanol; NSC 5221; tetrahydropyran-2-ylmethanol

Condensed phase thermochemistry data

Data compiled by: Eugene S. Domalski and Elizabeth D. Hearing
Constant pressure heat capacity of liquid
Cp,liquid (J/mol*K) | Temperature (K) | Reference |
---|---|---|
222. | 298.15 | Bonner and Cerutti, 1976 |

Phase change data

Data compiled as indicated in comments:
BS - Robert L. Brown and Stephen E. Stein
TRC - Thermodynamics Research Center, NIST Boulder Laboratories, Chris Muzny director
AC - William E. Acree, Jr., James S. Chickos
Quantity | Value | Units | Method | Reference | Comment |
---|---|---|---|---|---|
Tboil | 460.2 | K | N/A | Weast and Grasselli, 1989 | BS |
Tboil | 460.35 | K | N/A | Anonymous, 1958 | TRC |
Enthalpy of vaporization
ΔvapH (kJ/mol) | Temperature (K) | Method | Reference | Comment |
---|---|---|---|---|
49.0 | 359. | A | Stephenson and Malanowski, 1987 | Based on data from 344. to 460. K.; AC |

References

Bonner and Cerutti, 1976
Bonner, O.D.; Cerutti, P.J.,
The partial molar heat capacities of some solutes in water and deuterium oxide,
J. Chem. Thermodynam., 1976, 8, 105-111. [all data]
Weast and Grasselli, 1989
CRC Handbook of Data on Organic Compounds, 2nd Editon, Weast,R.C and Grasselli, J.G., ed(s)., CRC Press, Inc., Boca Raton, FL, 1989, 1. [all data]
Anonymous, 1958
Anonymous, X.,
Am. Pet. Inst. Res. Proj. 50, 1958, Unpublished, 1958. [all data]
Stephenson and Malanowski, 1987
Stephenson, Richard M.; Malanowski, Stanislaw,
Handbook of the Thermodynamics of Organic Compounds, 1987, https://doi.org/10.1007/978-94-009-3173-2
. [all data]