Benzoic acid, 2-(dimethylamino)-, methyl ester
- Formula: C10H13NO2
- Molecular weight: 179.2157
- IUPAC Standard InChIKey: ZCNSBHAIPOWHJE-UHFFFAOYSA-N
- CAS Registry Number: 10072-05-6
- Chemical structure:
View 3d structure (requires JavaScript / HTML 5) - Other names: Anthranilic acid, N,N-dimethyl-, methyl ester; Methyl N,N-dimethylanthranilate; Methyl 2-(dimethylamino)benzoate; N,N-Dimethylanthranilic acid methyl ester

Van Den Dool and Kratz RI, non-polar column, temperature ramp

Column type | Active phase | I | Reference | Comment |
---|---|---|---|---|
Capillary | VF-5MS | 1417. | Todua, 2011 | 30. m/0.25 mm/0.25 μm, He; Tstart: 60. C; Tend: 270. C |

Normal alkane RI, non-polar column, temperature ramp

Column type | Active phase | I | Reference | Comment |
---|---|---|---|---|
Capillary | VF-5 MS | 1404. | Leffingwell and Alford, 2011 | 60. m/0.32 mm/0.25 μm, Helium, 2. K/min, 260. C @ 28. min; Tstart: 30. C |
Capillary | VF-5 MS | 1404. | Leffingwell and Alford, 2011 | 60. m/0.32 mm/0.25 μm, Helium, 2. K/min, 260. C @ 28. min; Tstart: 30. C |

References

Todua, 2011
Todua, N.G.,
Retention Data. NIST Mass Spectrometry Data Center., NIST Mass Spectrometry Data Center, 2011. [all data]
Leffingwell and Alford, 2011
Leffingwell, J.; Alford, E.D.,
Volatile constituents of the giant pufball mushroom (Calvatia gigantea),
Leffingwell Rep., 2011, 4, 1-17. [all data]