3-Pyridinol, 4-methyl-, acetate (ester)
- Formula: C8H9NO2
- Molecular weight: 151.1626
- IUPAC Standard InChIKey: JLIFSYCXGJGLGE-UHFFFAOYSA-N
- CAS Registry Number: 1006-96-8
- Chemical structure:
View 3d structure (requires JavaScript / HTML 5) - Other names: 3-Acetoxy-4-methylpyridine

Normal alkane RI, polar column, temperature ramp

Column type | Active phase | I | Reference | Comment |
---|---|---|---|---|
Capillary | FFAP | 1897. | Nebesny, Budryn, et al., 2007 | 30. m/0.32 mm/0.5 μm, N2, 35. C @ 5. min, 4. K/min, 320. C @ 45. min |

References

Nebesny, Budryn, et al., 2007
Nebesny, E.; Budryn, G.; Kula, J.; Majda, T.,
The effect of roasting method on headspace composition of robusta coffee bean aroma,
Eur. Food Res. Technol., 2007, 225, 1, 9-19, https://doi.org/10.1007/s00217-006-0375-0
. [all data]