Phenol, 2,6-diethyl-
- Formula: C10H14O
- Molecular weight: 150.2176
- IUPAC Standard InChIKey: METWAQRCMRWDAW-UHFFFAOYSA-N
- CAS Registry Number: 1006-59-3
- Chemical structure:
View 3d structure (requires JavaScript / HTML 5) - Other names: 2,6-diethylphenol

Phase change data

Data compiled by: Thermodynamics Research Center, NIST Boulder Laboratories, Chris Muzny director
Quantity | Value | Units | Method | Reference | Comment |
---|---|---|---|---|---|
Tboil | 492.15 | K | N/A | Kolka, Napolitano, et al., 1957 | Uncertainty assigned by TRC = 3. K |
Tboil | 492.15 | K | N/A | Kolka, Napolitano, et al., 1956 | Uncertainty assigned by TRC = 3. K |
Tboil | 491.15 | K | N/A | Jager and Kattwinkel, 1955 | Uncertainty assigned by TRC = 3. K |
Quantity | Value | Units | Method | Reference | Comment |
Tfus | 310.8 ± 0.5 | K | AVG | N/A | Average of 7 values; Individual data points |

Kovats' RI, non-polar column, temperature ramp

View large format table.

Column type Active phase I Reference Comment
CapillarySE-301218.Medvedovskaya, Tikhomirova, et al., 19977. K/min; Tstart: 50. C; Tend: 320. C

References

Kolka, Napolitano, et al., 1957
Kolka, A.J.; Napolitano, J.P.; Filbey, A.H.; Ecke, G.G.,
J. Org. Chem., 1957, 22, 642. [all data]
Kolka, Napolitano, et al., 1956
Kolka, A.J.; Napolitano, J.P.; Ecke, G.G.,
J. Org. Chem., 1956, 21, 712. [all data]
Jager and Kattwinkel, 1955
Jager, A.; Kattwinkel, R.,
Erdoel Kohle, 1955, 8, 706. [all data]