1,2,3,4-tetrahydrofluoranthene
- Formula: C16H14
- Molecular weight: 206.2824
- IUPAC Standard InChIKey: HWEWZSACZIURKQ-UHFFFAOYSA-N
- CAS Registry Number: 100652-57-1
- Chemical structure:
View 3d structure (requires JavaScript / HTML 5) - Permanent link for this species. Use this link for bookmarking this species for future reference.

Phase change data

Data compiled by: Thermodynamics Research Center, NIST Boulder Laboratories, Chris Muzny director
Quantity | Value | Units | Method | Reference | Comment |
---|---|---|---|---|---|
Tfus | 347.15 | K | N/A | Anonymous, 1968 | Uncertainty assigned by TRC = 0.5 K |
Tfus | 347.2 | K | N/A | Anonymous, 1952 | Uncertainty assigned by TRC = 2. K |

References

Anonymous, 1968
Anonymous, R.,
Properties of hydrocarbon of high molecular weight, Am. Pet. Inst. Res. Proj. 42, Penn. State Univ., 1968. [all data]
Anonymous, 1952
Anonymous, R.,
, Physical Properties of Chemical Substances, Dow Chemical Co., 1952. [all data]