Benzenamine, N-hydroxy-
- Formula: C6H7NO
- Molecular weight: 109.1259
- IUPAC Standard InChIKey: CKRZKMFTZCFYGB-UHFFFAOYSA-N
- CAS Registry Number: 100-65-2
- Chemical structure:
View 3d structure (requires JavaScript / HTML 5) - Other names: Hydroxylamine, N-phenyl-; β-Phenylhydroxylamine; N-Hydroxyaniline; N-Hydroxybenzenamine; N-Phenylhydroxylamine; Phenylhydroxyamine; Phenylhydroxylamine; Aniline, N-hydroxy-; NCI-C60093; NSC 223099

Phase change data

Data compiled by: Thermodynamics Research Center, NIST Boulder Laboratories, Chris Muzny director
Quantity | Value | Units | Method | Reference | Comment |
---|---|---|---|---|---|
Tfus | 352.15 | K | N/A | Bruhl, 1897 | Uncertainty assigned by TRC = 2. K |

References

Bruhl, 1897
Bruhl, J.W.,
Spectrochemistry of nitrogen containing compounds V,
Z. Phys. Chem., Stoechiom. Verwandtschaftsl., 1897, 22, 373. [all data]