1-Propene, 1,3-dichloro-, (E)-
- Formula: C3H4Cl2
- Molecular weight: 110.970
- IUPAC Standard InChIKey: UOORRWUZONOOLO-OWOJBTEDSA-N
- CAS Registry Number: 10061-02-6
- Chemical structure:
View 3d structure (requires JavaScript / HTML 5) - Species with the same structure:
- Stereoisomers:
- Other names: Propene, 1,3-dichloro-, (E)-; (E)-1,3-Dichloropropene; trans-1,3-Dichloro-1-Propene; trans-1,3-Dichloropropene; trans-1,3-Dichloropropylene

Phase change data

Data compiled as indicated in comments:
BS - Robert L. Brown and Stephen E. Stein
TRC - Thermodynamics Research Center, NIST Boulder Laboratories, Chris Muzny director
Quantity | Value | Units | Method | Reference | Comment |
---|---|---|---|---|---|
Tboil | 385.2 | K | N/A | Weast and Grasselli, 1989 | BS |
Tboil | 384. | K | N/A | Akagi, Oae, et al., 1956 | Uncertainty assigned by TRC = 2. K; TRC |

Reaction thermochemistry data

Data compiled by: Hussein Y. Afeefy, Joel F. Liebman, and Stephen E. Stein

Individual Reactions

1-Propene, 1,3-dichloro-, (Z)- = 1-Propene, 1,3-dichloro-, (E)-

By formula: C3H4Cl2 = C3H4Cl2

Quantity Value Units Method Reference Comment
Δr2.4 ± 1.0kJ/molEqkIzmailov, Karaseva, et al., 1974gas phase

1-Propene, 3,3-dichloro- = 1-Propene, 1,3-dichloro-, (E)-

By formula: C3H4Cl2 = C3H4Cl2

Quantity Value Units Method Reference Comment
Δr-11.4 ± 1.3kJ/molEqkIzmailov, Karaseva, et al., 1974gas phase

References

Weast and Grasselli, 1989
CRC Handbook of Data on Organic Compounds, 2nd Editon, Weast,R.C and Grasselli, J.G., ed(s)., CRC Press, Inc., Boca Raton, FL, 1989, 1. [all data]
Akagi, Oae, et al., 1956
Akagi, K.; Oae, S.; Murakami, M.,
Effect of Substituent on the Reactivity of ω-Substituted Primary Alkyl Halide in the Reaction wtih Sodium Thiosulfate,
J. Am. Chem. Soc., 1956, 78, 4034-7. [all data]