1-Propene, 1,3-dichloro-, (Z)-
- Formula: C3H4Cl2
- Molecular weight: 110.970
- IUPAC Standard InChIKey: UOORRWUZONOOLO-UPHRSURJSA-N
- CAS Registry Number: 10061-01-5
- Chemical structure:
View 3d structure (requires JavaScript / HTML 5) - Stereoisomers:
- Other names: cis-1,3-Dichloro-1-Propene; Propene, 1,3-dichloro-, (Z)-; (Z)-1,3-Dichloropropene; cis-1,3-Dichloropropene; cis-1,3-Dichloropropylene

Phase change data

Data compiled as indicated in comments:
BS - Robert L. Brown and Stephen E. Stein
TRC - Thermodynamics Research Center, NIST Boulder Laboratories, Chris Muzny director
Quantity | Value | Units | Method | Reference | Comment |
---|---|---|---|---|---|
Tboil | 377.5 | K | N/A | Weast and Grasselli, 1989 | BS |
Tboil | 377. | K | N/A | Akagi, Oae, et al., 1956 | Uncertainty assigned by TRC = 2. K; TRC |

Reaction thermochemistry data

Data compiled by: Hussein Y. Afeefy, Joel F. Liebman, and Stephen E. Stein
Individual Reactions
By formula: C3H4Cl2 = C3H4Cl2
Quantity | Value | Units | Method | Reference | Comment |
---|---|---|---|---|---|
ΔrH° | 2.4 ± 1.0 | kJ/mol | Eqk | Izmailov, Karaseva, et al., 1974 | gas phase |
By formula: C3H4Cl2 = C3H4Cl2
Quantity | Value | Units | Method | Reference | Comment |
---|---|---|---|---|---|
ΔrH° | -14. ± 1.3 | kJ/mol | Eqk | Izmailov, Karaseva, et al., 1974 | gas phase |

Henry's Law data

Data compiled by: Rolf Sander
Henry's Law constant (water solution)
kH(T) = k°H exp(d(ln(kH))/d(1/T) ((1/T) - 1/(298.15 K)))
k°H = Henry's law constant for solubility in water at 298.15 K (mol/(kg*bar))
d(ln(kH))/d(1/T) = Temperature dependence constant (K)
k°H (mol/(kg*bar)) | d(ln(kH))/d(1/T) (K) | Method | Reference |
---|---|---|---|
0.42 | L | N/A | |
0.43 | V | N/A |

Normal alkane RI, non-polar column, temperature ramp

Column type | Active phase | I | Reference | Comment |
---|---|---|---|---|
Capillary | SE-54 | 750. | Huang, Liang, et al., 1996 | 36. m/0.25 mm/0.25 μm, 5. K/min; Tstart: 35. C; Tend: 240. C |

Normal alkane RI, non-polar column, custom temperature program

Column type | Active phase | I | Reference | Comment |
---|---|---|---|---|
Capillary | OV-1, SE-30, Methyl silicone, SP-2100, OV-101, DB-1, etc. | 724. | Waggott and Davies, 1984 | Hydrogen; Column length: 50. m; Column diameter: 0.32 mm; Program: not specified |

Normal alkane RI, polar column, custom temperature program

Column type | Active phase | I | Reference | Comment |
---|---|---|---|---|
Capillary | Superox 0.6; Carbowax 20M | 1183. | Waggott and Davies, 1984 | Hydrogen; Column length: 50. m; Column diameter: 0.32 mm; Program: not specified |
Capillary | Carbowax 400, Carbowax 20M, Carbowax 1540, Carbowax 4000, Superox 06, PEG 20M, etc. | 1183. | Waggott and Davies, 1984 | Hydrogen; Column length: 50. m; Column diameter: 0.32 mm; Program: not specified |

References

Weast and Grasselli, 1989
CRC Handbook of Data on Organic Compounds, 2nd Editon, Weast,R.C and Grasselli, J.G., ed(s)., CRC Press, Inc., Boca Raton, FL, 1989, 1. [all data]
Akagi, Oae, et al., 1956
Akagi, K.; Oae, S.; Murakami, M.,
Effect of Substituent on the Reactivity of ω-Substituted Primary Alkyl Halide in the Reaction wtih Sodium Thiosulfate,
J. Am. Chem. Soc., 1956, 78, 4034-7. [all data]
Izmailov, Karaseva, et al., 1974
Izmailov, V.D.; Karaseva, S.Ya.; Rozhnov, A.M.,
Equilibrium of isomerization of dichloropropylenes,
Izv. Vyssh. Uchebn. Zaved., Khim. Khim. Tekhnol., 1974, 17, 562-564. [all data]
Huang, Liang, et al., 1996
Huang, C.; Liang, H.; Han, S.,
The analysis of organic compounds in waste water by gas extraction/thermal desorption/gas chromatography-mass spectrometry,
Chin. J. Chromatogr., 1996, 14, 6, 421-424. [all data]
Waggott and Davies, 1984
Waggott, A.; Davies, I.W.,
Identification of organic pollutants using linear temperature programmed retention indices (LTPRIs) - Part II, 1984, retrieved from http://dwi.defra.gov.uk/research/completed-research/reports/dwi0383.pdf. [all data]