Cyclohexanamine, N-methyl-

Kovats' RI, non-polar column, isothermal

View large format table.

Column type Active phase Temperature (C) I Reference Comment
PackedApiezon L100.934.Golovnya, Zhuravleva, et al., 1981N2, Chromosorb GAW; Column length: 2.7 m

Van Den Dool and Kratz RI, non-polar column, temperature ramp

View large format table.

Column type Active phase I Reference Comment
CapillaryVF-5MS947.N/A30. m/0.25 mm/0.25 μm, He; Tstart: 60. C; Tend: 270. C

Phase change data

Data compiled by: Robert L. Brown and Stephen E. Stein

Quantity Value Units Method Reference Comment
Tboil422.2KN/AWeast and Grasselli, 1989

References

Golovnya, Zhuravleva, et al., 1981
Golovnya, R.V.; Zhuravleva, I.L.; Svetlova, N.I.; Grigor'eva, D.N.; Terenina, M.B.; Gutnik, S.B., Gas-chromatographic behavior of secondary isoaliphatic and alicyclic amines, J. Anal. Chem. USSR (Engl. Transl.), 1981, 36, 4, 501-505. [all data]