1-Methylnorbornane
- Formula: C8H14
- Molecular weight: 110.1968
- IUPAC Standard InChIKey: UTPHVTOEOCZQJU-UHFFFAOYSA-N
- CAS Registry Number: 10052-18-3
- Chemical structure:
View 3d structure (requires JavaScript / HTML 5) - Species with the same structure:

Condensed phase thermochemistry data

Data compiled by: Hussein Y. Afeefy, Joel F. Liebman, and Stephen E. Stein
Quantity | Value | Units | Method | Reference | Comment |
---|---|---|---|---|---|
ΔfH°liquid | -130.9 ± 1.1 | kJ/mol | Ccb | Kozina, 1976 | |
Quantity | Value | Units | Method | Reference | Comment |
ΔcH°liquid | -5018.0 ± 1.0 | kJ/mol | Ccb | Kozina, 1976 | Corresponding ΔfHºliquid = -130.9 kJ/mol (simple calculation by NIST; no Washburn corrections) |

References

Kozina, 1976
Kozina, M.P.,
Enthalpies of combustion and formation of bicyclic and polycyclic hydrocarbons,
Sovrem. Probl. Fiz. Khim., 1976, 9, 198-225. [all data]