Pentafluoroguanidine
- Formula: CF5N3
- Molecular weight: 149.0228
- IUPAC Standard InChIKey: HVBIIJJZPHDCMS-UHFFFAOYSA-N
- CAS Registry Number: 10051-06-6
- Chemical structure:
View 3d structure (requires JavaScript / HTML 5) - Permanent link for this species. Use this link for bookmarking this species for future reference.

Gas phase thermochemistry data

Data compiled by: Hussein Y. Afeefy, Joel F. Liebman, and Stephen E. Stein
Quantity | Value | Units | Method | Reference | Comment |
---|---|---|---|---|---|
ΔfH°gas | 95.7 ± 3.6 | kJ/mol | Cm | Sinke, Thompson, et al., 1967 | Reanalyzed by Cox and Pilcher, 1970, Original value = 96.2 kJ/mol; Energy of explosion |

Reaction thermochemistry data

Data compiled by: Hussein Y. Afeefy, Joel F. Liebman, and Stephen E. Stein
Individual Reactions
By formula: 2CF5N3 = 2CF4 + 3N2 + F2
Quantity | Value | Units | Method | Reference | Comment |
---|---|---|---|---|---|
ΔrH° | -2059. | kJ/mol | Cm | Sinke, Thompson, et al., 1967 | gas phase; Energy of explosion |

References

Sinke, Thompson, et al., 1967
Sinke, G.C.; Thompson, C.J.; Jostad, R.E.; Walker, L.C.; Swanson, A.C.; Stull, D.R.,
Enthalpies of formation and bond energies of some fluoramines,
J. Chem. Phys., 1967, 47, 1852-1854. [all data]
Cox and Pilcher, 1970
Cox, J.D.; Pilcher, G.,
Thermochemistry of Organic and Organometallic Compounds, Academic Press, New York, 1970, 1-636. [all data]