Cyclohexanemethanol
- Formula: C7H14O
- Molecular weight: 114.1855
- IUPAC Standard InChIKey: VSSAZBXXNIABDN-UHFFFAOYSA-N
- CAS Registry Number: 100-49-2
- Chemical structure:
View 3d structure (requires JavaScript / HTML 5) - Other names: (Hydroxymethyl)cyclohexane; Cyclohexanecarbinol; Cyclohexylcarbinol; Cyclohexylmethanol; Cyclohexylmethyl alcohol; Hexahydrobenzyl alcohol; Benzyl alcohol, hexahydro-; Methanol, cyclohexyl-; USAF DO-49; NSC 5288

Condensed phase thermochemistry data

Data compiled by: Hussein Y. Afeefy, Joel F. Liebman, and Stephen E. Stein
Quantity | Value | Units | Method | Reference | Comment |
---|---|---|---|---|---|
ΔfH°liquid | -378. | kJ/mol | Ccb | Landrieu, Baylocq, et al., 1929 | |
Quantity | Value | Units | Method | Reference | Comment |
ΔcH°liquid | -4377.3 | kJ/mol | Ccb | Landrieu, Baylocq, et al., 1929 | Corresponding ΔfHºliquid = -378. kJ/mol (simple calculation by NIST; no Washburn corrections) |

Gas phase ion energetics data

Data evaluated as indicated in comments:
HL - Edward P. Hunter and Sharon G. Lias
Data compiled as indicated in comments:
B - John E. Bartmess
Quantity | Value | Units | Method | Reference | Comment |
---|---|---|---|---|---|
Proton affinity (review) | 802.1 | kJ/mol | N/A | Hunter and Lias, 1998 | HL |
Quantity | Value | Units | Method | Reference | Comment |
Gas basicity | 771.7 | kJ/mol | N/A | Hunter and Lias, 1998 | HL |
De-protonation reactions
C7H13O- + =
By formula: C7H13O- + H+ = C7H14O
Quantity | Value | Units | Method | Reference | Comment |
---|---|---|---|---|---|
ΔrH° | 1564. ± 8.8 | kJ/mol | G+TS | Taft, 1987 | gas phase; value altered from reference due to change in acidity scale; B |
Quantity | Value | Units | Method | Reference | Comment |
ΔrG° | 1536. ± 8.4 | kJ/mol | IMRE | Taft, 1987 | gas phase; value altered from reference due to change in acidity scale; B |

Reaction thermochemistry data

Data compiled by: John E. Bartmess
Individual Reactions
C7H13O- + =
By formula: C7H13O- + H+ = C7H14O
Quantity | Value | Units | Method | Reference | Comment |
---|---|---|---|---|---|
ΔrH° | 1564. ± 8.8 | kJ/mol | G+TS | Taft, 1987 | gas phase; value altered from reference due to change in acidity scale |
Quantity | Value | Units | Method | Reference | Comment |
ΔrG° | 1536. ± 8.4 | kJ/mol | IMRE | Taft, 1987 | gas phase; value altered from reference due to change in acidity scale |

Phase change data

Data compiled by: Robert L. Brown and Stephen E. Stein
Quantity | Value | Units | Method | Reference | Comment |
---|---|---|---|---|---|
Tboil | 454.2 | K | N/A | Aldrich Chemical Company Inc., 1990 | |
Tboil | 456.2 | K | N/A | Weast and Grasselli, 1989 |

References

Landrieu, Baylocq, et al., 1929
Landrieu, P.; Baylocq, F.; Johnson, J.R.,
Etude thermochimique dans la serie furanique,
Bull. Soc. Chim. France, 1929, 45, 36-49. [all data]
Hunter and Lias, 1998
Hunter, E.P.; Lias, S.G.,
Evaluated Gas Phase Basicities and Proton Affinities of Molecules: An Update,
J. Phys. Chem. Ref. Data, 1998, 27, 3, 413-656, https://doi.org/10.1063/1.556018
. [all data]
Taft, 1987
Taft, R.W.,
The Nature and Analysis of Substitutent Electronic Effects,
Personal communication. See also Prog. Phys. Org. Chem., 1987, 16, 1. [all data]