4-Cyanocyclohexene
- Formula: C7H9N
- Molecular weight: 107.1531
- IUPAC Standard InChIKey: GYBNBQFUPDFFQX-UHFFFAOYSA-N
- CAS Registry Number: 100-45-8
- Chemical structure:
View 3d structure (requires JavaScript / HTML 5) - Other names: 3-Cyclohexene-1-carbonitrile; 3-Cyclohexenecarbonitrile; Tetrahydrobenzonitrile; 4-Cyanocyclohexene-1; 4-Cyano-1-cyclohexene; 1-Cyano-3-cyclohexene; 3-Cyclohexenyl cyanide; 3-Cyklohexenylkyanid; 4-Cyclohexenecarbonitrile

Phase change data

Data compiled by: Robert L. Brown and Stephen E. Stein
Reduced pressure boiling point
Tboil (K) | Pressure (bar) | Reference |
---|---|---|
368. to 369. | 0.037 | Frinton Laboratories Inc., 1986 |

References

Frinton Laboratories Inc., 1986
Frinton Laboratories Inc.,
Catalog Number 11, Frinton Laboratories Inc., Vineland, NJ, 1986, 99. [all data]