Boron nitride
- Formula: BN
- Molecular weight: 24.818
- IUPAC Standard InChIKey: PZNSFCLAULLKQX-UHFFFAOYSA-N
- CAS Registry Number: 10043-11-5
- Chemical structure:
View 3d structure (requires JavaScript / HTML 5) - Permanent link for this species. Use this link for bookmarking this species for future reference.

Gas phase thermochemistry data

Quantity | Value | Units | Method | Reference | Comment |
---|---|---|---|---|---|
ΔfH°gas | 476.98 | kJ/mol | Review | Chase, 1998 | Data last reviewed in June, 1966 |
Quantity | Value | Units | Method | Reference | Comment |
S°gas,1 bar | 212.36 | J/mol*K | Review | Chase, 1998 | Data last reviewed in June, 1966 |
Gas Phase Heat Capacity (Shomate Equation)
Cp° = A + B*t + C*t2 + D*t3 +
E/t2
H° − H°298.15= A*t + B*t2/2 +
C*t3/3 + D*t4/4 − E/t + F − H
S° = A*ln(t) + B*t + C*t2/2 + D*t3/3 −
E/(2*t2) + G
Cp = heat capacity (J/mol*K)
H° = standard enthalpy (kJ/mol)
S° = standard entropy (J/mol*K)
t = temperature (K) / 1000.
View plot Requires a JavaScript / HTML 5 canvas capable browser.
Temperature (K) | 298. to 1100. | 1100. to 6000. |
---|---|---|
A | 19.85496 | 33.82873 |
B | 30.08191 | 2.431142 |
C | -19.85823 | -0.246413 |
D | 4.829173 | 0.009495 |
E | 0.201627 | -0.795086 |
F | 470.5619 | 464.0809 |
G | 229.3932 | 248.3417 |
H | 476.9760 | 476.9760 |
Reference | Chase, 1998 | Chase, 1998 |
Comment | Data last reviewed in June, 1966 | Data last reviewed in June, 1966 |

Condensed phase thermochemistry data

Quantity | Value | Units | Method | Reference | Comment |
---|---|---|---|---|---|
ΔfH°solid | -250.91 | kJ/mol | Review | Chase, 1998 | Data last reviewed in June, 1966 |
Quantity | Value | Units | Method | Reference | Comment |
S°solid | 14.77 | J/mol*K | Review | Chase, 1998 | Data last reviewed in June, 1966 |
Solid Phase Heat Capacity (Shomate Equation)
Cp° = A + B*t + C*t2 + D*t3 +
E/t2
H° − H°298.15= A*t + B*t2/2 +
C*t3/3 + D*t4/4 − E/t + F − H
S° = A*ln(t) + B*t + C*t2/2 + D*t3/3 −
E/(2*t2) + G
Cp = heat capacity (J/mol*K)
H° = standard enthalpy (kJ/mol)
S° = standard entropy (J/mol*K)
t = temperature (K) / 1000.
View plot Requires a JavaScript / HTML 5 canvas capable browser.
Temperature (K) | 298. to 1100. | 1100. to 3500. |
---|---|---|
A | -1.626426 | 78.14750 |
B | 101.9817 | -23.33367 |
C | -81.52482 | 6.844396 |
D | 25.65093 | -0.699753 |
E | -0.223052 | -17.04034 |
F | -255.0479 | -311.8377 |
G | -15.45766 | 66.05657 |
H | -250.9145 | -250.9145 |
Reference | Chase, 1998 | Chase, 1998 |
Comment | Data last reviewed in June, 1966 | Data last reviewed in June, 1966 |

Gas phase ion energetics data

Data compiled by: John E. Bartmess
Electron affinity determinations
EA (eV) | Method | Reference | Comment |
---|---|---|---|
3.1600 ± 0.0050 | LPES | Asmis, Taylor, et al., 1998 | |
2.90 ± 0.30 | N/A | Reid, 1993 |

Constants of diatomic molecules

Data compiled by: Klaus P. Huber and Gerhard H. Herzberg

Data collected through June, 1976

Symbols used in the table of constants
SymbolMeaning
State electronic state and / or symmetry symbol
Te minimum electronic energy (cm-1)
ωe vibrational constant – first term (cm-1)
ωexe vibrational constant – second term (cm-1)
ωeye vibrational constant – third term (cm-1)
Be rotational constant in equilibrium position (cm-1)
αe rotational constant – first term (cm-1)
γe rotation-vibration interaction constant (cm-1)
De centrifugal distortion constant (cm-1)
βe rotational constant – first term, centrifugal force (cm-1)
re internuclear distance (Å)
Trans. observed transition(s) corresponding to electronic state
ν00 position of 0-0 band (units noted in table)
Diatomic constants for 11B14N
StateTeωeωexeωeyeBeαeγeDeβereTrans.ν00
           R 34499 H
Douglas and Herzberg, 1940
           R 32817 H
Douglas and Herzberg, 1940
           V 30963 H
Douglas and Herzberg, 1940
A 3Π 27875.0 1317.5 H 14.9  1.555 0.010  (0.0000087)  1.326 A ↔ X R 27775.8 H
missing citation; Nicholls, Fraser, et al., 1959; Thrush, 1960; Mosher and Frosch, 1970
StateTeωeωexeωeyeBeαeγeDeβereTrans.ν00
X 3Π 0 1 1514.6 H 12.3  1.666 0.025  (0.0000081)  1.281

References

Chase, 1998
Chase, M.W., Jr.,
NIST-JANAF Themochemical Tables, Fourth Edition,
J. Phys. Chem. Ref. Data, Monograph 9, 1998, 1-1951. [all data]
Asmis, Taylor, et al., 1998
Asmis, K.R.; Taylor, T.R.; Neumark, D.M.,
Anion photoelectron spectroscopy of BN-,
Chem. Phys. Lett., 1998, 295, 1-2, 75-81, https://doi.org/10.1016/S0009-2614(98)00943-9
. [all data]
Reid, 1993
Reid, C.J.,
Electron Affinities of BH, B2, BC, and BN molecules determined using Charge Inversion Spectrometry,
Int. J. Mass Spectrom. Ion Proc., 1993, 127, 147, https://doi.org/10.1016/0168-1176(93)87087-9
. [all data]