terbium (III) chloride hexahydrate

Ion clustering data

Data compiled by: John E. Bartmess

Clustering reactions

Chlorine anion + Cl3Tb = Cl4Tb-

By formula: Cl- + Cl3Tb = Cl4Tb-

Quantity Value Units Method Reference Comment
Δr353. ± 18.kJ/molTDEqKudin, Vorob'ev, et al., 2007gas phase; value altered from reference due to conversion from electron convention to ion convention
Δr304. ± 6.7kJ/molTDEqKhasanshin, Kudin, et al., 1999gas phase; value altered from reference due to conversion from electron convention to ion convention

TbCl4- + Cl3Tb = Cl7Tb2-

By formula: TbCl4- + Cl3Tb = Cl7Tb2-

Quantity Value Units Method Reference Comment
Δr242. ± 38.kJ/molTDEqKudin, Vorob'ev, et al., 2007gas phase; value altered from reference due to conversion from electron convention to ion convention
Δr374. ± 10.kJ/molTDEqKhasanshin, Kudin, et al., 1999gas phase; value altered from reference due to conversion from electron convention to ion convention

TbCl4- + 2Cl3Tb = Cl10Tb3-

By formula: TbCl4- + 2Cl3Tb = Cl10Tb3-

Quantity Value Units Method Reference Comment
Δr390. ± 9.6kJ/molTDEqKhasanshin, Kudin, et al., 1999gas phase; value altered from reference due to conversion from electron convention to ion convention

TbCl4- + 3Cl3Tb = Cl13Tb4-

By formula: TbCl4- + 3Cl3Tb = Cl13Tb4-

Quantity Value Units Method Reference Comment
Δr320. ± 84.kJ/molTDEqKhasanshin, Kudin, et al., 1999gas phase; value altered from reference due to conversion from electron convention to ion convention

Reaction thermochemistry data

Data compiled by: John E. Bartmess

Individual Reactions

TbCl4- + Cl3Tb = Cl7Tb2-

By formula: TbCl4- + Cl3Tb = Cl7Tb2-

Quantity Value Units Method Reference Comment
Δr57.8 ± 9.1kcal/molTDEqKudin, Vorob'ev, et al., 2007gas phase; value altered from reference due to conversion from electron convention to ion convention
Δr89.4 ± 2.5kcal/molTDEqKhasanshin, Kudin, et al., 1999gas phase; value altered from reference due to conversion from electron convention to ion convention

Chlorine anion + Cl3Tb = Cl4Tb-

By formula: Cl- + Cl3Tb = Cl4Tb-

Quantity Value Units Method Reference Comment
Δr84.4 ± 4.3kcal/molTDEqKudin, Vorob'ev, et al., 2007gas phase; value altered from reference due to conversion from electron convention to ion convention
Δr72.7 ± 1.6kcal/molTDEqKhasanshin, Kudin, et al., 1999gas phase; value altered from reference due to conversion from electron convention to ion convention

TbCl4- + 2Cl3Tb = Cl10Tb3-

By formula: TbCl4- + 2Cl3Tb = Cl10Tb3-

Quantity Value Units Method Reference Comment
Δr93.3 ± 2.3kcal/molTDEqKhasanshin, Kudin, et al., 1999gas phase; value altered from reference due to conversion from electron convention to ion convention

TbCl4- + 3Cl3Tb = Cl13Tb4-

By formula: TbCl4- + 3Cl3Tb = Cl13Tb4-

Quantity Value Units Method Reference Comment
Δr76. ± 20.kcal/molTDEqKhasanshin, Kudin, et al., 1999gas phase; value altered from reference due to conversion from electron convention to ion convention

References

Kudin, Vorob'ev, et al., 2007
Kudin, L.S.; Vorob'ev, D.E.; Grishin, A.E., The Thermochemical Characteristics of the LnCl4- and Ln2Cl7- Negative Ions, Russ. J. Phys. Chem., 2007, 81, 2, 147, https://doi.org/10.1134/S003602440702001X . [all data]

Khasanshin, Kudin, et al., 1999
Khasanshin, I.V.; Kudin, L.S.; Pogrebnoi, A.M., A mass spectrometric study of saturated vapor over terbium trichloride and the TbCl3-DyCl3 system, Russ. J. Phys. Chem., 1999, 73, 849-855. [all data]