Bicyclo(3.3.1)nonan-3-one
- Formula: C9H14O
- Molecular weight: 138.2069
- IUPAC Standard InChIKey: ANFLIDKLELMAAQ-UHFFFAOYSA-N
- CAS Registry Number: 10036-09-6
- Chemical structure:
View 3d structure (requires JavaScript / HTML 5) - Permanent link for this species. Use this link for bookmarking this species for future reference.

Gas phase thermochemistry data

Data compiled by: Hussein Y. Afeefy, Joel F. Liebman, and Stephen E. Stein
Quantity | Value | Units | Method | Reference | Comment |
---|---|---|---|---|---|
ΔfH°gas | -254. ± 8.4 | kJ/mol | Ccb | Steele, 1979 |

References

Steele, 1979
Steele, W.V.,
Thermochemically determined ΔH°f(g) values for ketones and alcohols,
Private Communication, University of Stirling, Stirling, Scotland, 1979, 0. [all data]