Furan, 2-ethyltetrahydro-
- Formula: C6H12O
- Molecular weight: 100.1589
- IUPAC Standard InChIKey: IHMXVSZXHFTOFN-UHFFFAOYSA-N
- CAS Registry Number: 1003-30-1
- Chemical structure:
View 3d structure (requires JavaScript / HTML 5) - Other names: 2-Ethyl-tetrahydrofuran

Phase change data

Data compiled by: Thermodynamics Research Center, NIST Boulder Laboratories, Chris Muzny director
Quantity | Value | Units | Method | Reference | Comment |
---|---|---|---|---|---|
Tboil | 378.15 | K | N/A | Jones and Fenske, 1959 | Uncertainty assigned by TRC = 0.5 K |
Tboil | 380.15 | K | N/A | Szarvasi, Dupont, et al., 1949 | Uncertainty assigned by TRC = 3. K |

Normal alkane RI, non-polar column, temperature ramp

Column type | Active phase | I | Reference | Comment |
---|---|---|---|---|
Capillary | OV-101 | 768. | Zenkevich, 2005 | 25. m/0.20 mm/0.10 μm, N2/He, 6. K/min; Tstart: 50. C; Tend: 250. C |

Normal alkane RI, non-polar column, custom temperature program

Column type | Active phase | I | Reference | Comment |
---|---|---|---|---|
Capillary | Methyl Silicone | 768. | Farkas, Héberger, et al., 2004 | Program: not specified |

References

Jones and Fenske, 1959
Jones, J.H.; Fenske, M.R.,
Ind. Eng. Chem., 1959, 51, 262. [all data]
Szarvasi, Dupont, et al., 1949
Szarvasi, E.; Dupont, G.; Dulou, R.,
Some Reactions of Furfural I. Tetrahydrofuran Series,
Chim. Ind. (Paris), 1949, 62, 143. [all data]
Zenkevich, 2005
Zenkevich, I.G.,
Experimentally measured retention indices., 2005. [all data]
Farkas, Héberger, et al., 2004
Farkas, O.; Héberger, K.; Zenkevich, I.G.,
Quantitative structure-retention relationships. XIV. Prediction of gas chromatographic retention indices for saturated O-, N-, and S-heterocyclic compounds,
Chemom. Intell. Lab. Syst., 2004, 72, 2, 173-184, https://doi.org/10.1016/j.chemolab.2004.01.012
. [all data]