Tetrahydrofuran, 2,2-dimethyl-
- Formula: C6H12O
- Molecular weight: 100.1589
- IUPAC Standard InChIKey: ZPDIRKNRUWXYLJ-UHFFFAOYSA-N
- CAS Registry Number: 1003-17-4
- Chemical structure:
View 3d structure (requires JavaScript / HTML 5) - Other names: 2,2-Dimethyltetrahydrofuran

Gas phase ion energetics data

Data evaluated by: Edward P. Hunter and Sharon G. Lias
Quantity | Value | Units | Method | Reference | Comment |
---|---|---|---|---|---|
Proton affinity (review) | 847.7 | kJ/mol | N/A | Hunter and Lias, 1998 | |
Quantity | Value | Units | Method | Reference | Comment |
Gas basicity | 818.5 | kJ/mol | N/A | Hunter and Lias, 1998 |

References

Hunter and Lias, 1998
Hunter, E.P.; Lias, S.G.,
Evaluated Gas Phase Basicities and Proton Affinities of Molecules: An Update,
J. Phys. Chem. Ref. Data, 1998, 27, 3, 413-656, https://doi.org/10.1063/1.556018
. [all data]