Dihydro-2(3H)-thiophenone
- Formula: C4H6OS
- Molecular weight: 102.155
- IUPAC Standard InChIKey: KMSNYNIWEORQDJ-UHFFFAOYSA-N
- CAS Registry Number: 1003-10-7
- Chemical structure:
View 3d structure (requires JavaScript / HTML 5) - Other names: γ-Thiobutyrolactone; 4-Butyrothiolactone; 2(3H)-Thiophenone, dihydro-; 2-Thiophenone, tetrahydro-; 2-Oxothiolane; Tetrahydro-2-thiophenone; Thiacyclopentan-2-one; Thiacyclopentanone-2; 4-Thiobutyrolactone; Thiolan-2-one; 2-Oxotetrahydrothiophene; NSC 54087

Gas phase thermochemistry data

Data compiled by: Hussein Y. Afeefy, Joel F. Liebman, and Stephen E. Stein
Quantity | Value | Units | Method | Reference | Comment |
---|---|---|---|---|---|
ΔfH°gas | -196.2 ± 2.0 | kJ/mol | Ccb | Geiseler and Sawistowsky, 1972 |

Condensed phase thermochemistry data

Data compiled by: Hussein Y. Afeefy, Joel F. Liebman, and Stephen E. Stein
Quantity | Value | Units | Method | Reference | Comment |
---|---|---|---|---|---|
ΔcH°liquid | -2800. ± 1.7 | kJ/mol | Ccb | Geiseler and Sawistowsky, 1972 |

Phase change data

Data compiled as indicated in comments:
BS - Robert L. Brown and Stephen E. Stein
ALS - Hussein Y. Afeefy, Joel F. Liebman, and Stephen E. Stein
Quantity | Value | Units | Method | Reference | Comment |
---|---|---|---|---|---|
ΔvapH° | 38.2 ± 0.8 | kJ/mol | V | Geiseler and Sawistowsky, 1972 | ALS |
Reduced pressure boiling point
Tboil (K) | Pressure (bar) | Reference | Comment |
---|---|---|---|
312.7 | 0.001 | Weast and Grasselli, 1989 | BS |

Normal alkane RI, non-polar column, temperature ramp

View large format table.

Column type Active phase I Reference Comment
CapillaryDB-1952.Guntert, Brüning, et al., 199060. m/0.32 mm/0.25 μm, He, 3. K/min; Tstart: 60. C; Tend: 220. C

Normal alkane RI, polar column, temperature ramp

View large format table.

Column type Active phase I Reference Comment
CapillaryDB-Wax1615.Guntert, Brüning, et al., 199060. m/0.32 mm/0.25 μm, He, 3. K/min; Tstart: 60. C; Tend: 220. C

References

Geiseler and Sawistowsky, 1972
Geiseler, V.G.; Sawistowsky, J.,
Bildungsenthalpien und Mesomerieenergien von π-Bindungssystemen. 4. Mitteilung: Bildungsenthalpien einiger Thiacyclannone,
Z. Phys. Chem. (Leipzig), 1972, 250, 43-48. [all data]
Weast and Grasselli, 1989
CRC Handbook of Data on Organic Compounds, 2nd Editon, Weast,R.C and Grasselli, J.G., ed(s)., CRC Press, Inc., Boca Raton, FL, 1989, 1. [all data]