Cyclopentanamine
- Formula: C5H11N
- Molecular weight: 85.1475
- IUPAC Standard InChIKey: NISGSNTVMOOSJQ-UHFFFAOYSA-N
- CAS Registry Number: 1003-03-8
- Chemical structure:
View 3d structure (requires JavaScript / HTML 5) - Other names: Cyclopentylamine; Amino cyclopentane

Gas phase thermochemistry data

Data compiled by: Hussein Y. Afeefy, Joel F. Liebman, and Stephen E. Stein
Quantity | Value | Units | Method | Reference | Comment |
---|---|---|---|---|---|
ΔfH°gas | -54.86 ± 0.92 | kJ/mol | Ccb | Good, Messerly, et al., 1975 |

Condensed phase thermochemistry data

Data compiled as indicated in comments:
ALS - Hussein Y. Afeefy, Joel F. Liebman, and Stephen E. Stein
DH - Eugene S. Domalski and Elizabeth D. Hearing
Quantity | Value | Units | Method | Reference | Comment |
---|---|---|---|---|---|
ΔfH°liquid | -95.14 ± 0.84 | kJ/mol | Ccb | Good, Messerly, et al., 1975 | ALS |
Quantity | Value | Units | Method | Reference | Comment |
ΔcH°liquid | -3444.5 ± 0.79 | kJ/mol | Ccb | Good, Messerly, et al., 1975 | ALS |
Quantity | Value | Units | Method | Reference | Comment |
S°liquid | 241.04 | J/mol*K | N/A | Finke, Messerly, et al., 1981 | DH |
Constant pressure heat capacity of liquid
Cp,liquid (J/mol*K) | Temperature (K) | Reference | Comment |
---|---|---|---|
181.21 | 298. | Finke, Messerly, et al., 1981 | T = 12 to 349 K. Equation also given for temperature range 197 to 349 K.; DH |

Phase change data

Data compiled as indicated in comments:
BS - Robert L. Brown and Stephen E. Stein
TRC - Thermodynamics Research Center, NIST Boulder Laboratories, Chris Muzny director
ALS - Hussein Y. Afeefy, Joel F. Liebman, and Stephen E. Stein
DRB - Donald R. Burgess, Jr.
AC - William E. Acree, Jr., James S. Chickos
CAL - James S. Chickos, William E. Acree, Jr., Joel F. Liebman, Students of Chem 202 (Introduction to the Literature of Chemistry), University of Missouri -- St. Louis
DH - Eugene S. Domalski and Elizabeth D. Hearing
Quantity | Value | Units | Method | Reference | Comment |
---|---|---|---|---|---|
Tboil | 381.2 | K | N/A | Weast and Grasselli, 1989 | BS |
Tboil | 381.62 | K | N/A | Timmermans and Hennaut-Roland, 1955 | Uncertainty assigned by TRC = 0.2 K; TRC |
Tboil | 381. | K | N/A | Bollinger, Hayes, et al., 1953 | Uncertainty assigned by TRC = 6. K; TRC |
Quantity | Value | Units | Method | Reference | Comment |
Tfus | 187.45 | K | N/A | Timmermans and Hennaut-Roland, 1955 | Uncertainty assigned by TRC = 0.3 K; TRC |
Tfus | 187.45 | K | N/A | Timmermans, 1952 | Uncertainty assigned by TRC = 0.5 K; TRC |
Quantity | Value | Units | Method | Reference | Comment |
Ttriple | 190.45 | K | N/A | Finke, Messerly, et al., 1981, 2 | Crystal phase 1 phase; Uncertainty assigned by TRC = 0.02 K; TRC |
Quantity | Value | Units | Method | Reference | Comment |
ΔvapH° | 40.2 ± 0.42 | kJ/mol | V | Good, Messerly, et al., 1975 | ALS |
ΔvapH° | 40.3 | kJ/mol | N/A | Good, Messerly, et al., 1975 | DRB |
ΔvapH° | 40.2 ± 0.4 | kJ/mol | EB | Good, Messerly, et al., 1975 | Based on data from 317. to 419. K.; AC |
Enthalpy of vaporization
ΔvapH (kJ/mol) | Temperature (K) | Method | Reference | Comment |
---|---|---|---|---|
38.3 | 332. | EB | Stephenson and Malanowski, 1987 | Based on data from 317. to 419. K. See also Ambrose, Connett, et al., 1975.; AC |
Enthalpy of fusion
ΔfusH (kJ/mol) | Temperature (K) | Reference | Comment |
---|---|---|---|
8.31 | 190.4 | Domalski and Hearing, 1996 | AC |
Entropy of fusion
ΔfusS (J/mol*K) | Temperature (K) | Reference | Comment |
---|---|---|---|
2.58 | 184.5 | Domalski and Hearing, 1996 | CAL |
43.65 | 190.4 |
Enthalpy of phase transition
ΔHtrs (kJ/mol) | Temperature (K) | Initial Phase | Final Phase | Reference | Comment |
---|---|---|---|---|---|
0.4753 | 184.5 | crystaline, II | crystaline, I | Finke, Messerly, et al., 1981 | Lambda type transition.; DH |
8.3128 | 190.45 | crystaline, I | liquid | Finke, Messerly, et al., 1981 | DH |
Entropy of phase transition
ΔStrs (J/mol*K) | Temperature (K) | Initial Phase | Final Phase | Reference | Comment |
---|---|---|---|---|---|
2.58 | 184.5 | crystaline, II | crystaline, I | Finke, Messerly, et al., 1981 | Lambda; DH |
43.65 | 190.45 | crystaline, I | liquid | Finke, Messerly, et al., 1981 | DH |

References

Good, Messerly, et al., 1975
Good, W.D.; Messerly, J.F.; Osborn, A.G.; Douslin, D.R.,
Enthalpies of formation of cyclopentylamine and cyclobutylamine; vapor pressure of cyclopentylamine,
J. Chem. Thermodyn., 1975, 7, 285-291. [all data]
Finke, Messerly, et al., 1981
Finke, H.L.; Messerly, J.F.; Lee-Bechtold, S.H.,
Thermodynamic properties of cyclopropylamine, cyclopentylamine, and methylenecyclobutane,
J. Chem. Thermodyn., 1981, 13, 345-355. [all data]
Weast and Grasselli, 1989
CRC Handbook of Data on Organic Compounds, 2nd Editon, Weast,R.C and Grasselli, J.G., ed(s)., CRC Press, Inc., Boca Raton, FL, 1989, 1. [all data]
Timmermans and Hennaut-Roland, 1955
Timmermans, J.; Hennaut-Roland, M.,
Work of the International Bureau of Physical-Chemical Standards. IX. The Physical Constants of Twenty Organic Compounds,
J. Chim. Phys. Phys.-Chim. Biol., 1955, 52, 223. [all data]
Bollinger, Hayes, et al., 1953
Bollinger, F.W.; Hayes, F.N.; Siegel, S.,
The Base-Catalyzed Decomposition of N-Nitroso-N-cyclopentylurethan,
J. Am. Chem. Soc., 1953, 75, 1729-30. [all data]
Timmermans, 1952
Timmermans, J.,
Freezing points of organic compounds. VVI New determinations.,
Bull. Soc. Chim. Belg., 1952, 61, 393. [all data]
Finke, Messerly, et al., 1981, 2
Finke, H.L.; Messerly, J.F.; Lee-Bechtold, S.H.,
Thermodynamic properties of cyclopropylamine,cyclopentylamine,and methylenecyclobutane,
J. Chem. Thermodyn., 1981, 13, 345. [all data]
Stephenson and Malanowski, 1987
Stephenson, Richard M.; Malanowski, Stanislaw,
Handbook of the Thermodynamics of Organic Compounds, 1987, https://doi.org/10.1007/978-94-009-3173-2
. [all data]
Ambrose, Connett, et al., 1975
Ambrose, D.; Connett, J.E.; Green, J.H.S.; Hales, J.L.; Head, A.J.; Martin, J.F.,
Thermodynamic properties of organic oxygen compounds. 42. Physical and thermodynamic properties of benzaldehyde,
J. Chem. Thermodyn., 1975, 7, 1143-1157. [all data]
Domalski and Hearing, 1996
Domalski, Eugene S.; Hearing, Elizabeth D.,
Heat Capacities and Entropies of Organic Compounds in the Condensed Phase. Volume III,
J. Phys. Chem. Ref. Data, 1996, 25, 1, 1, https://doi.org/10.1063/1.555985
. [all data]