Benzene, 1-isocyanato-4-nitro-
- Formula: C7H4N2O3
- Molecular weight: 164.1183
- IUPAC Standard InChIKey: GFNKTLQTQSALEJ-UHFFFAOYSA-N
- CAS Registry Number: 100-28-7
- Chemical structure:
View 3d structure (requires JavaScript / HTML 5) - Other names: Isocyanic acid, p-nitrophenyl ester; p-Nitrophenyl isocyanate; 4-Nitrophenyl isocyanate; 1-Isocyanato-4-nitrobenzene

Reaction thermochemistry data

Data compiled by: Hussein Y. Afeefy, Joel F. Liebman, and Stephen E. Stein
Individual Reactions
+
= C15H23N3O3
By formula: C7H4N2O3 + C8H19N = C15H23N3O3
Quantity | Value | Units | Method | Reference | Comment |
---|---|---|---|---|---|
ΔrH° | -113.6 ± 0.7 | kJ/mol | Cm | Kiselev, Malkov, et al., 1989 | liquid phase; solvent: Dioxane; #TDE |
By formula: C7H4N2O3 + C6H7N = C13H11N3O3
Quantity | Value | Units | Method | Reference | Comment |
---|---|---|---|---|---|
ΔrH° | -83.8 ± 0.3 | kJ/mol | Cm | Kiselev, Malkov, et al., 1989 | liquid phase; solvent: Dioxane; #TDE |

References

Kiselev, Malkov, et al., 1989
Kiselev, V.D.; Malkov, V.B.; Murzin, D.G.; Shakirov, I.M.; Konovalov, A.I.,
Thermochemical study of the reaction of isocyanate with amines,
Dokl. Phys. Chem. (Engl. Transl.), 1989, 308, 711-713, In original 111. [all data]