Pentadecanoic acid
- Formula: C15H30O2
- Molecular weight: 242.3975
- IUPAC Standard InChIKey: WQEPLUUGTLDZJY-UHFFFAOYSA-N
- CAS Registry Number: 1002-84-2
- Chemical structure:
View 3d structure (requires JavaScript / HTML 5) - Other names: Pentadecylic acid; n-Pentadecanoic acid; n-Pentadecylic acid; Pentadecanoic (Palmitic) acid

Condensed phase thermochemistry data

Data compiled as indicated in comments:
ALS - Hussein Y. Afeefy, Joel F. Liebman, and Stephen E. Stein
DH - Eugene S. Domalski and Elizabeth D. Hearing
Quantity | Value | Units | Method | Reference | Comment |
---|---|---|---|---|---|
ΔcH°liquid | -9327.7 ± 1.5 | kJ/mol | Ccb | Adriaanse, Dekker, et al., 1965 | Hfusion=50.0 kJ/mol; Corresponding ΔfHºliquid = -862.4 kJ/mol (simple calculation by NIST; no Washburn corrections); ALS |
Constant pressure heat capacity of solid
Cp,solid (J/mol*K) | Temperature (K) | Reference | Comment |
---|---|---|---|
443.28 | 298.15 | Schaake, van Miltenburg, et al., 1982 | T = 80 to 345 K.; DH |

Phase change data

Data compiled as indicated in comments:
BS - Robert L. Brown and Stephen E. Stein
TRC - Thermodynamics Research Center, NIST Boulder Laboratories, Chris Muzny director
AC - William E. Acree, Jr., James S. Chickos
ALS - Hussein Y. Afeefy, Joel F. Liebman, and Stephen E. Stein
CAL - James S. Chickos, William E. Acree, Jr., Joel F. Liebman, Students of Chem 202 (Introduction to the Literature of Chemistry), University of Missouri -- St. Louis
DH - Eugene S. Domalski and Elizabeth D. Hearing
Quantity | Value | Units | Method | Reference | Comment |
---|---|---|---|---|---|
Tfus | 326. ± 2. | K | AVG | N/A | Average of 8 values; Individual data points |
Quantity | Value | Units | Method | Reference | Comment |
Ttriple | 325.68 | K | N/A | Schaake, van Miltenburg, et al., 1982, 2 | Crystal phase 1 phase; Uncertainty assigned by TRC = 0.02 K; TRC |
Quantity | Value | Units | Method | Reference | Comment |
Tc | 775.43 | K | N/A | D'Souza and Teja, 1987 | Uncertainty assigned by TRC = 3. K; Ambrose's procedure; TRC |
Quantity | Value | Units | Method | Reference | Comment |
Pc | 15.5134 | bar | N/A | D'Souza and Teja, 1987 | Uncertainty assigned by TRC = 0.85 bar; Ambrose's procedure; TRC |
Quantity | Value | Units | Method | Reference | Comment |
ΔsubH° | 156. | kJ/mol | V | Baccanari, Novinski, et al., 1968 | ALS |
Reduced pressure boiling point
Tboil (K) | Pressure (bar) | Reference | Comment |
---|---|---|---|
530.2 | 0.133 | Weast and Grasselli, 1989 | BS |
Enthalpy of vaporization
ΔvapH (kJ/mol) | Temperature (K) | Method | Reference | Comment |
---|---|---|---|---|
94. | 446. | A | Stephenson and Malanowski, 1987 | Based on data from 431. to 613. K.; AC |
108.5 ± 2.0 | 357. | ME,TE | de Kruif, Schaake, et al., 1982 | Based on data from 347. to 367. K.; AC |
Enthalpy of sublimation
ΔsubH (kJ/mol) | Temperature (K) | Method | Reference | Comment |
---|---|---|---|---|
144.3 | 275. to 293. | TPTD | Chattopadhyay and Ziemann, 2005 | AC |
178. | 283. to 305. | TPTD | Chattopadhyay, Tobias, et al., 2001 | Experimental values based on the TPTD method are often inconsistent with values determined using other experimental methods; AC |
Enthalpy of fusion
ΔfusH (kJ/mol) | Temperature (K) | Method | Reference | Comment |
---|---|---|---|---|
40.4 | 325.5 | DSC | Gbabode, Negrier, et al., 2007 | See also Gbabode, Negrier, et al., 2008 and Gbabode, Negrier, et al., 2009.; AC |
41.52 | 325.7 | N/A | Domalski and Hearing, 1996 | AC |
46.1 | 324.9 | N/A | Berchiesi, Bercuiesi, et al., 1976 | AC |
Entropy of fusion
ΔfusS (J/mol*K) | Temperature (K) | Reference | Comment |
---|---|---|---|
25.48 | 318.7 | Domalski and Hearing, 1996 | CAL |
127.49 | 325.7 |
Enthalpy of phase transition
ΔHtrs (kJ/mol) | Temperature (K) | Initial Phase | Final Phase | Reference | Comment |
---|---|---|---|---|---|
8.123 | 318.7 | crystaline, II | crystaline, I | Schaake, van Miltenburg, et al., 1982 | DH |
41.526 | 325.68 | crystaline, I | liquid | Schaake, van Miltenburg, et al., 1982 | DH |
Entropy of phase transition
ΔStrs (J/mol*K) | Temperature (K) | Initial Phase | Final Phase | Reference | Comment |
---|---|---|---|---|---|
25.47 | 318.7 | crystaline, II | crystaline, I | Schaake, van Miltenburg, et al., 1982 | DH |
127.50 | 325.68 | crystaline, I | liquid | Schaake, van Miltenburg, et al., 1982 | DH |

Normal alkane RI, non-polar column, temperature ramp

Data compiled by: NIST Mass Spectrometry Data Center, William E. Wallace, director

Column type CapillaryCapillaryCapillaryCapillaryCapillary
Active phase HP-5 MSMethylsiloxane + 5 % Ph-groupsHP-5 MSHP-5DB-1
Column length (m) 30.30.30.30.30.
Carrier gas HeliumHeliumHeliumHydrogenHelium
Substrate
Column diameter (mm) 0.250.250.250.250.25
Phase thickness (μm) 0.250.250.250.250.25
Tstart (C) 40.60.70.70.50.
Tend (C) 260.230.290.290.220.
Heat rate (K/min) 4.7.5.5.4.
Initial hold (min)  2.  2.
Final hold (min) 5.20.10. 2.
I 1867.1848.1862.1862.1843.
ReferenceMiyazawa, Marumoto, et al., 2011Nadim, Malik, et al., 2011Radulovic, Blagojevic, et al., 2010Radulovic, Dordevic, et al., 2010Xu, Tang, et al., 2010
Comment MSDC-RI MSDC-RI MSDC-RI MSDC-RI MSDC-RI
Column type CapillaryCapillaryCapillaryCapillaryCapillary
Active phase HP-1HP-5 MSHP-5 MSDB-5PE-5
Column length (m) 25.30.30.30.50.
Carrier gas  HeliumHeliumHeHe
Substrate
Column diameter (mm) 0.320.250.250.250.32
Phase thickness (μm) 0.170.250.250.250.25
Tstart (C) 50.50.50.60.100.
Tend (C) 260.280.230.320.280.
Heat rate (K/min) 1.4.4.10.3.
Initial hold (min) 5. 4. 1.
Final hold (min) 5. 10.4.
I 1845.1862.1878.1856.1882.
ReferenceWetwiayaklung, Thavanapong, et al., 2009Zhao, Zeng, et al., 2009Forero, Quijano, et al., 2008Smelcerovic, Spiteller, et al., 2007Pandey-Rai S., Mallavarapu G.R., et al., 2006
Comment MSDC-RI MSDC-RI MSDC-RI MSDC-RI MSDC-RI
Column type CapillaryCapillaryCapillaryCapillaryCapillary
Active phase SPB-5HP-5DB-5DB-5HP-5
Column length (m) 30.30.30.30.60.
Carrier gas HeliumH2HeHeHe
Substrate
Column diameter (mm) 0.250.250.250.250.32
Phase thickness (μm) 0.250.250.250.250.25
Tstart (C) 60.50.40.40.30.
Tend (C) 250.280.260.250.260.
Heat rate (K/min) 4.4.2.4.2.
Initial hold (min) 2.2.5.2.2.
Final hold (min) 20.10.20.10.28.
I 1868.1883.1865.1873.1866.2
ReferencePino, Marquez, et al., 2006Pino, Sauri-Duch, et al., 2006Senatore, Landolfi, et al., 2006Shen X., Gao Y., et al., 2006Leffingwell and Alford, 2005
Comment MSDC-RI MSDC-RI MSDC-RI MSDC-RI MSDC-RI
Column type CapillaryCapillaryCapillaryCapillaryCapillary
Active phase SPB-5DB-5HP-5HP-5HP-5MS
Column length (m) 30.30.30.30.30.
Carrier gas HeHeHeliumHeliumHe
Substrate
Column diameter (mm) 0.250.250.320.320.25
Phase thickness (μm) 0.250.250.250.250.25
Tstart (C) 60.40.40.40.60.
Tend (C) 250.260.250.250.275.
Heat rate (K/min) 4.2.5.5.4.
Initial hold (min) 2.5.2.2.
Final hold (min) 20.20.5.5.
I 1881.1865.1857.1857.1869.
ReferencePino, Marbot, et al., 2005Senatore, Apostolides Arnold, et al., 2005N/AN/AGhannadi, Aghazari, et al., 2003
Comment MSDC-RI MSDC-RI MSDC-RI MSDC-RI MSDC-RI
Column type CapillaryCapillaryCapillaryCapillaryCapillary
Active phase DB-5SPB-5Optima-1Optima-1HP-5MS
Column length (m) 30.30.25.25.30.
Carrier gas H2HeliumHeHeHe
Substrate
Column diameter (mm) 0.250.250.200.200.25
Phase thickness (μm) 0.250.250.250.250.25
Tstart (C) 60.60.50.50.40.
Tend (C) 280.250.250.250.280.
Heat rate (K/min) 4.4.3.3.10.
Initial hold (min) 10.2.3.3.1.
Final hold (min) 40.20.  20.
I 1870.1880.1858.1866.1868.
ReferencePino, Marbot, et al., 2003Pino, Marbot, et al., 2002Brun, Bessière, et al., 2001de Beck, Bessière, et al., 2000Tkachev, Dobrotvorsky, et al., 2000
Comment MSDC-RI MSDC-RI MSDC-RI MSDC-RI MSDC-RI
Column type CapillaryCapillaryCapillaryCapillaryCapillary
Active phase Methyl SiliconeHP-1Cross-Linked MethylsiliconeDB-5Ultra-1
Column length (m) 50.25.25.60.25.
Carrier gas H2H2HeHeHe
Substrate
Column diameter (mm) 0.250.320.320.320.32
Phase thickness (μm) 0.50.17 1.00.25
Tstart (C) 40.40.35.40.80.
Tend (C) 260.260.225.240.260.
Heat rate (K/min) 4.3.4.3.3.
Initial hold (min) 0.55.3.
Final hold (min)
I 1858.1848.1845.1851.1861.
ReferenceVendramini and Trugo, 2000Lopes, Koketsu, et al., 1999Bravo and Hotchkiss, 1993Berdague, Denoyer, et al., 1991Okumura, 1991
Comment MSDC-RI MSDC-RI MSDC-RI MSDC-RI MSDC-RI
Column type Capillary
Active phase SE-54
Column length (m) 25.
Carrier gas N2
Substrate
Column diameter (mm) 0.25
Phase thickness (μm)
Tstart (C) 60.
Tend (C) 260.
Heat rate (K/min) 6.
Initial hold (min) 2.
Final hold (min)
I 1862.
ReferenceBestmann, Classen, et al., 1988
Comment MSDC-RI

Van Den Dool and Kratz RI, non-polar column, temperature ramp

Data compiled by: NIST Mass Spectrometry Data Center, William E. Wallace, director

Column type CapillaryCapillaryCapillaryCapillaryCapillary
Active phase HP-5MSDB-5DB-5HP-5MSCP Sil 5 CB
Column length (m) 30.30.30.30.25.
Carrier gas HeHeHeHeH2
Substrate
Column diameter (mm) 0.250.320.320.250.25
Phase thickness (μm) 0.250.250.250.25
Tstart (C) 60.40.40.80.80.
Tend (C) 250.250.250.300.270.
Heat rate (K/min) 2.5.5.4.10.
Initial hold (min) 8.2.2.
Final hold (min) 30.5.5.
I 1869.1857.1857.1868.41823.
ReferenceBenkaci-Ali, Baaliouamer, et al., 2007Wu, Zorn, et al., 2007Wu, Zorn, et al., 2007Zeng, Zhao, et al., 2007Ziegenbein, Hanssen, et al., 2006
Comment MSDC-RI MSDC-RI MSDC-RI MSDC-RI MSDC-RI
Column type CapillaryCapillaryCapillaryCapillaryCapillary
Active phase CP Sil 5 CBDB-5HP-5HP-5MSDB-5
Column length (m) 25.25.30.30.30.
Carrier gas HeN2HeHeHe
Substrate
Column diameter (mm) 0.250.250.250.250.32
Phase thickness (μm) 0.40.250.250.250.25
Tstart (C) 80.75.60.60.40.
Tend (C) 270.210.260.250.250.
Heat rate (K/min) 10.3.3.4.5.
Initial hold (min)  10. 2.2.
Final hold (min)  1. 20.5.
I 1823.1863.1867.1878.1857.
ReferenceZiegenbein, Hanssen, et al., 2006, 2bin Jantan, Yalvema, et al., 2005Javidnia, Miri, et al., 2005Pino, Mesa, et al., 2005Wu, Zorn, et al., 2005
Comment MSDC-RI MSDC-RI MSDC-RI MSDC-RI MSDC-RI
Column type CapillaryCapillaryCapillaryCapillaryCapillary
Active phase HP-5SPB-5SPB-5CP Sil 5 CBSPB-5
Column length (m) 30.30.30.60.30.
Carrier gas HeHeHeHeHe
Substrate
Column diameter (mm) 0.250.250.250.320.25
Phase thickness (μm)  0.250.250.250.25
Tstart (C) 60.60.60.60.60.
Tend (C) 260.250.250.280.250.
Heat rate (K/min) 3.4.4.3.4.
Initial hold (min)  2.2.10.2.
Final hold (min)  20.20.60.20.
I 1887.1872.1869.1844.1872.
ReferenceJavidnia, Miri, et al., 2004Píno, Marbot, et al., 2004Pino, Marbot, et al., 2004Pino, Almora, et al., 2003Pino, Marbot, et al., 2003
Comment MSDC-RI MSDC-RI MSDC-RI MSDC-RI MSDC-RI
Column type CapillaryCapillaryCapillaryCapillaryCapillary
Active phase CP Sil 5 CBCP Sil 5 CBCP Sil 5 CBHP-5DB-5
Column length (m) 50.50.50.30.30.
Carrier gas HeHeHeHeH2
Substrate
Column diameter (mm) 0.320.320.320.250.25
Phase thickness (μm) 0.40.40.40.250.25
Tstart (C) 60.60.60.50.50.
Tend (C) 280.280.280.280.290.
Heat rate (K/min) 3.3.3.4.4.
Initial hold (min) 10.10.10.5.
Final hold (min) 60.60.60.
I 1845.1844.1844.1865.1833.
ReferencePino, Marbot, et al., 2002Pino and Marbot, 2001Pino, Marbot, et al., 2001Lazari, Skaltsa, et al., 2000da Silva, Borba, et al., 1999
Comment MSDC-RI MSDC-RI MSDC-RI MSDC-RI MSDC-RI
Column type Capillary
Active phase DB-1
Column length (m) 30.
Carrier gas
Substrate
Column diameter (mm) 0.2
Phase thickness (μm) 0.25
Tstart (C) 50.
Tend (C) 300.
Heat rate (K/min) 5.
Initial hold (min) 2.
Final hold (min) 5.
I 1839.
ReferenceJohnson, Urso, et al., 1997
Comment MSDC-RI

Normal alkane RI, non-polar column, custom temperature program

Data compiled by: NIST Mass Spectrometry Data Center, William E. Wallace, director

Column type CapillaryCapillaryCapillaryCapillaryCapillary
Active phase TR-5 MSTR-5 MSRTX-5 MSHP-5 MSDB-1
Column length (m) 15.15.15.30.30.
Carrier gas HeliumHeliumHeliumHeliumHelium
Substrate
Column diameter (mm) 0.250.250.250.250.25
Phase thickness (μm) 0.250.250.250.250.25
Program 35 0C (3 min) 2 0C/min -> 60 0C (3 min) 2 0C/min -> 80 0C (3 min) 4 0C/min -> 120 0C (3 min) 5 0C/min -> 150 0C (3 min) 15 0C/min -> 240 0C (10 min)35 0C (3 min) 2 0C/min -> 60 0C (3 min) 2 0C/min -> 80 0C (3 min) 4 0C/min -> 120 0C (3 min) 5 0C/min -> 150 0C (3 mion) 15 0C/min -> 240 0C (10 min)35 0C (6 min) 5 0C/min -> 150 0C 10 0C/min -> 280 0C (3 min)40 0C (5 min) 30 0C/min -> 60 0C 6 0C/min -> 230 0C (10 min)not specified
I 1877.1890.1857.1845.1857.
ReferenceKurashov, Mitrukova, et al., 2014Kurashov, Krylova, et al., 2013Nadaf, Halimi, et al., 2012Grzeszczuk, Wesolowska, et al., 2011Xu, Tang, et al., 2010
Comment MSDC-RI MSDC-RI MSDC-RI MSDC-RI MSDC-RI
Column type CapillaryCapillaryCapillaryCapillaryCapillary
Active phase HP-5 MSRTX-5 MSRTX-5 MSHP-1HP-5
Column length (m) 30.30.30.25.30.
Carrier gas HeliumHeliumHelium
Substrate
Column diameter (mm) 0.250.250.250.320.25
Phase thickness (μm) 0.250.250.250.170.25
Program 40 0C (5 min) 2 0C/min -> 270 0C -> 260 0C (20 min)50 0C (5 min) 2 0C/min -> 100 0C (5 min) 5 0C/min -> 300 0Cnot specifiednot specified40 0C (2 min) 5 0C/min -> 80 0C 7 oC/min -> 160 0C 9 0C/min -> 200 0C 20 0C/min -> 280 0C (10 min)
I 1873.1876.1878.1842.1859.
ReferenceMancini, Arnold, et al., 2009Mebazaa, Mahmoudi, et al., 2009Mebazaa, Mahmoudi, et al., 2009Wetwiayaklung, Thavanapong, et al., 2009Zhao, Li, et al., 2008
Comment MSDC-RI MSDC-RI MSDC-RI MSDC-RI MSDC-RI
Column type CapillaryCapillaryCapillaryCapillaryCapillary
Active phase HP-5HP-5MSHP-5MSPolydimethyl siloxane with 5 % Ph groupsHP-5
Column length (m) 30.30.30. 30.
Carrier gas  HeHe He
Substrate
Column diameter (mm) 0.250.250.25 0.25
Phase thickness (μm) 0.250.250.25 0.25
Program not specified40C(5min) => 2C/min => 250C(15min) => 10C/min => 270C40C(3min) => 2C/min => 180C => 10C/min => 250C(5min)not specified60C(5min) => 3C/min => 120C (2min) => 2C/min => 200C (2min) => 3C/min => 320C
I 1865.1860.1881.1869.1867.
ReferenceZhao, Li, et al., 2008Formisano C., Senatore F., et al., 2006Alissandrakis, Kibaris, et al., 2005Pino, Marbot, et al., 2005Yasar, Üçüncü, et al., 2005
Comment MSDC-RI MSDC-RI MSDC-RI MSDC-RI MSDC-RI
Column type CapillaryCapillaryCapillaryCapillaryCapillary
Active phase DB-5 MSHP-5SF-96DB-1DB-1
Column length (m) 30.30.40.60.60.
Carrier gas HeliumHe
Substrate
Column diameter (mm) 0.250.250.280.250.25
Phase thickness (μm) 1.00.25 0.250.25
Program not specified40C (10min) => 3C/min => 120C => 10C/min => 250C (5min)75C => 3C/min => 190C(25min) => 3C/min => 210Cnot specifiednot specified
I 1855.1871.1841.1850.1854.
ReferenceLuo and Agnew, 2001Ansorena, Astiasarán, et al., 2000Kawasaki, Matsui, et al., 1998Kawai, Ishida, et al., 1991Kawai, Ishida, et al., 1991
Comment MSDC-RI MSDC-RI MSDC-RI MSDC-RI MSDC-RI

Normal alkane RI, polar column, custom temperature program

Data compiled by: NIST Mass Spectrometry Data Center, William E. Wallace, director

Column type CapillaryCapillaryCapillaryCapillaryCapillary
Active phase Innowax FSCInnowaxDB-FFAPHP Innowax FSPInnowax FSC
Column length (m) 60.60.30.60.60.
Carrier gas Helium HeliumN2He
Substrate
Column diameter (mm) 0.250.250.250.250.25
Phase thickness (μm) 0.250.330.250.250.25
Program 60 0C (10 min) 4 0C/min -> 220 0C 1 0C/min -> 240 0Cnot specified50 0C 2 0C/min -> 100 0C (5 min) 5 0C/min -> 250 0C60C(10min) => 4C/min => 220C(10min) => 1C/min => 240C60C(10min) => 4C/min => 220C (10min) => 1C/min => 240C
I 2822.2822.2809.2822.2822.
ReferenceBardakci, Demirci, et al., 2012Noorizadeh, Farmany, et al., 2011Mebazaa, Mahmoudi, et al., 2009Tabanca N., Demirci B., et al., 2007Baser K.H.C., Ozek G., et al., 2006
Comment MSDC-RI MSDC-RI MSDC-RI MSDC-RI MSDC-RI
Column type CapillaryCapillaryCapillaryCapillaryCapillary
Active phase Innowax FSCHP-Innowax FSCInnowax FSCHP Innowax FSPInnowax FSC
Column length (m) 60.60.60.60.60.
Carrier gas HeN2HeN2He
Substrate
Column diameter (mm) 0.250.250.250.250.25
Phase thickness (μm) 0.250.250.250.250.25
Program 60C(10min) => 4C/min >220C (10min) => 1C/min => 240C60C(10min) => 4C/min => 220C(10min) => 1C/min => 240C60C(10min) => 4C/min => 220C(10min) => 1C/min => 240C60C(10min) => 4C/min => 220C(10min) => 1C/min => 240C60C(10min) => 4C/min => 220C(10min) => 1C/min => 240C
I 2822.2822.2822.2822.2822.
ReferenceBaser, Özek, et al., 2006Demirci B., Baser K.H.C., et al., 2006Kosar, Özek, et al., 2005Altintas, Kose, et al., 2004Baser, Özek, et al., 2004
Comment MSDC-RI MSDC-RI MSDC-RI MSDC-RI MSDC-RI
Column type CapillaryCapillaryCapillaryCapillaryCapillary
Active phase HP-Innowax FSCHP-Innowax FSCInnowaxHP-InnowaxInnowax FSC
Column length (m) 60.60.60.60.60.
Carrier gas HeHeHeHeHe
Substrate
Column diameter (mm) 0.250.250.250.250.25
Phase thickness (μm) 0.250.250.250.250.25
Program 60C(10min) => 4C/min => 220C(10min) => 1C/min => 240C60C(10min) => 4C/min => 220C(10min) => 1C/min => 240C60C(10min) => 4C/min => 220C(10min) => 1C/min => 240C (20min)60C(10min) => 4C/min => 220C(10min) => 1C/min => 240C60C(10 min) => 4C/min => 220C(10min) => 1C/min => 240C
I 2822.2822.2822.2822.2822.
ReferenceKivcak, Akay, et al., 2004Erdemoglu, Sener, et al., 2003Tunaher, Kirimer, et al., 2003Tabanca, Kirimer, et al., 2001Kirimer, Tabanca, et al., 2000
Comment MSDC-RI MSDC-RI MSDC-RI MSDC-RI MSDC-RI
Column type Capillary
Active phase DB-Wax
Column length (m) 30.
Carrier gas He
Substrate
Column diameter (mm) 0.25
Phase thickness (μm)
Program not specified
I 2803.
ReferenceHatsuko, Kazuko, et al., 1992
Comment MSDC-RI

Kovats' RI, non-polar column, custom temperature program

Data compiled by: NIST Mass Spectrometry Data Center, William E. Wallace, director

Column type CapillaryCapillaryCapillaryCapillary
Active phase BP-1BP-1BP-1HP-5
Column length (m) 25.25.30.30.
Carrier gas N2N2N2He
Substrate
Column diameter (mm) 0.250.250.320.25
Phase thickness (μm) 0.250.250.250.25
Program 60C => 5C/min => 220C(5min) => 3C/min => 245C(5min)60C => 5C/min => 220C (5min) => 3C/min => 245 C (5min)60 C 5 C/min -> 220 C (5 min) 3 C/min -> 245 C (5 min)50 0C 20 K/min -> 70 0C 9 K/min -> 280 0C
I 1867.1869.1869.1869.
ReferenceDwivedi, Khan, et al., 2004Khan, Srivastava, et al., 2003Khan, Srivastava, et al., 2002Stojanovic, Palic, et al., 2000
Comment MSDC-RI MSDC-RI MSDC-RI MSDC-RI

References

Adriaanse, Dekker, et al., 1965
Adriaanse, N.; Dekker, H.; Coops, J.,
Heats of combustion of normal saturated fatty acids and their methyl esters,
Rec. Trav. Chim. Pays/Bas, 1965, 84, 393-407. [all data]
Schaake, van Miltenburg, et al., 1982
Schaake, R.C.F.; van Miltenburg, J.C.; De Kruif, C.G.,
Thermodynamic properties of the normal alkanoic acids. I. Molar heat capacities of seven odd-numbered normal alkanoic acids,
J. Chem. Thermodynam., 1982, 14, 763-769. [all data]
Schaake, van Miltenburg, et al., 1982, 2
Schaake, R.C.F.; van Miltenburg, J.C.; De Kruif, C.G.,
Thermodynamic properties of the normal alkanoic acids. I. Molar heat capacities of seven odd-numbered normal alkanoic acids.,
J. Chem. Thermodyn., 1982, 14, 763. [all data]
D'Souza and Teja, 1987
D'Souza, R.; Teja, A.S.,
The prediction of the vapor pressures of carboxylic acids,
Chem. Eng. Commun., 1987, 61, 13. [all data]
Baccanari, Novinski, et al., 1968
Baccanari, D.P.; Novinski, J.A.; Pan, Y.; Yevitz, M.M.; Swain, H.A., Jr.,
Heats of sublimation and vaporization at 25° of long chain fatty acids and methyl esters,
Trans. Faraday Soc., 1968, 64, 1201. [all data]
Weast and Grasselli, 1989
CRC Handbook of Data on Organic Compounds, 2nd Editon, Weast,R.C and Grasselli, J.G., ed(s)., CRC Press, Inc., Boca Raton, FL, 1989, 1. [all data]
Stephenson and Malanowski, 1987
Stephenson, Richard M.; Malanowski, Stanislaw,
Handbook of the Thermodynamics of Organic Compounds, 1987, https://doi.org/10.1007/978-94-009-3173-2
. [all data]
de Kruif, Schaake, et al., 1982
de Kruif, C.G.; Schaake, R.C.F.; van Miltenburg, J.C.; van der Klauw, K.; Blok, J.G.,
Thermodynamic properties of the normal alkanoic acids III. Enthalpies of vaporization and vapour pressures of 13 normal alkanoic acids,
The Journal of Chemical Thermodynamics, 1982, 14, 8, 791-798, https://doi.org/10.1016/0021-9614(82)90176-8
. [all data]
Chattopadhyay and Ziemann, 2005
Chattopadhyay, Sulekha; Ziemann, Paul J.,
Vapor Pressures of Substituted and Unsubstituted Monocarboxylic and Dicarboxylic Acids Measured Using an Improved Thermal Desorption Particle Beam Mass Spectrometry Method,
Aerosol Science and Technology, 2005, 39, 11, 1085-1100, https://doi.org/10.1080/02786820500421547
. [all data]
Chattopadhyay, Tobias, et al., 2001
Chattopadhyay, Sulekha; Tobias, Herbert J.; Ziemann, Paul J.,
A Method for Measuring Vapor Pressures of Low-Volatility Organic Aerosol Compounds Using a Thermal Desorption Particle Beam Mass Spectrometer,
Anal. Chem., 2001, 73, 16, 3797-3803, https://doi.org/10.1021/ac010304j
. [all data]
Gbabode, Negrier, et al., 2007
Gbabode, Gabin; Negrier, Philippe; Mondieig, Denise; Moreno Calvo, Evelyn; Calvet, Teresa; Cuevas-Diarte, Miquel Àngel,
Structures of the High-Temperature Solid Phases of the Odd-Numbered Fatty Acids from Tridecanoic Acid to Tricosanoic Acid,
Chem. Eur. J., 2007, 13, 11, 3150-3159, https://doi.org/10.1002/chem.200600955
. [all data]
Gbabode, Negrier, et al., 2008
Gbabode, Gabin; Negrier, Philippe; Mondieig, Denise; Moreno, Evelyn; Calvet, Teresa; Cuevas-Diarte, Miquel Àngel,
Polymorphism and solid-state miscibility in the pentadecanoic acid--heptadecanoic acid binary system,
Chemistry and Physics of Lipids, 2008, 154, 1, 68-77, https://doi.org/10.1016/j.chemphyslip.2008.04.008
. [all data]
Gbabode, Negrier, et al., 2009
Gbabode, Gabin; Negrier, Philippe; Mondieig, Denise; Moreno, Evelyn; Calvet, Teresa; Cuevas-Diarte, Miquel Àngel,
Fatty acids polymorphism and solid-state miscibility,
Journal of Alloys and Compounds, 2009, 469, 1-2, 539-551, https://doi.org/10.1016/j.jallcom.2008.02.047
. [all data]
Domalski and Hearing, 1996
Domalski, Eugene S.; Hearing, Elizabeth D.,
Heat Capacities and Entropies of Organic Compounds in the Condensed Phase. Volume III,
J. Phys. Chem. Ref. Data, 1996, 25, 1, 1, https://doi.org/10.1063/1.555985
. [all data]
Berchiesi, Bercuiesi, et al., 1976
Berchiesi, G.; Bercuiesi, M.A.; Lobbia, G.G.; Leonesi, D.,
Gazz. Chim. Ital., 1976, 106, 549. [all data]