8-Aminocaprylic acid

Gas phase thermochemistry data

Data compiled by: Hussein Y. Afeefy, Joel F. Liebman, and Stephen E. Stein

Quantity Value Units Method Reference Comment
Δfgas-125. ± 1.kcal/molCcbSkoulika and Sabbah, 1983

Condensed phase thermochemistry data

Data compiled as indicated in comments:
ALS - Hussein Y. Afeefy, Joel F. Liebman, and Stephen E. Stein
DH - Eugene S. Domalski and Elizabeth D. Hearing

Quantity Value Units Method Reference Comment
Δfsolid-166.kcal/molCcbSkoulika and Sabbah, 1983ALS
Quantity Value Units Method Reference Comment
Δcsolid-1167.kcal/molCcbSkoulika and Sabbah, 1983ALS

Constant pressure heat capacity of solid

Cp,solid (cal/mol*K) Temperature (K) Reference Comment
60.16298.Skoulika and Sabbah, 1983DH

Phase change data

Data compiled as indicated in comments:
ALS - Hussein Y. Afeefy, Joel F. Liebman, and Stephen E. Stein
AC - William E. Acree, Jr., James S. Chickos

Quantity Value Units Method Reference Comment
Δsub40.6 ± 1.kcal/molCSkoulika and Sabbah, 1983ALS
Δsub40.6 ± 1.kcal/molCSkoulika and Sabbah, 1983AC

Enthalpy of sublimation

ΔsubH (kcal/mol) Temperature (K) Method Reference Comment
39.7 ± 0.2397.CSkoulika and Sabbah, 1983Based on data from 391. - 402. K.; AC

References

Skoulika and Sabbah, 1983
Skoulika, S.; Sabbah, R., Thermodynamique de composes azotes X. Etude thermochimique de quelques acides ω-amines, Thermochim. Acta, 1983, 61, 203-214. [all data]