Trichlorosilane
- Formula: Cl3HSi
- Molecular weight: 135.452
- IUPAC Standard InChIKey: ZDHXKXAHOVTTAH-UHFFFAOYSA-N
- CAS Registry Number: 10025-78-2
- Chemical structure:
View 3d structure (requires JavaScript / HTML 5) - Other names: Silane, trichloro

Gas phase thermochemistry data

Quantity | Value | Units | Method | Reference | Comment |
---|---|---|---|---|---|
ΔfH°gas | -496.22 | kJ/mol | Review | Chase, 1998 | Data last reviewed in December, 1976 |
Quantity | Value | Units | Method | Reference | Comment |
S°gas,1 bar | 313.71 | J/mol*K | Review | Chase, 1998 | Data last reviewed in December, 1976 |
Gas Phase Heat Capacity (Shomate Equation)
Cp° = A + B*t + C*t2 + D*t3 +
E/t2
H° − H°298.15= A*t + B*t2/2 +
C*t3/3 + D*t4/4 − E/t + F − H
S° = A*ln(t) + B*t + C*t2/2 + D*t3/3 −
E/(2*t2) + G
Cp = heat capacity (J/mol*K)
H° = standard enthalpy (kJ/mol)
S° = standard entropy (J/mol*K)
t = temperature (K) / 1000.
View plot Requires a JavaScript / HTML 5 canvas capable browser.
Temperature (K) | 298. to 1000. | 1000. to 6000. |
---|---|---|
A | 64.28214 | 104.3544 |
B | 85.31427 | 2.102059 |
C | -72.09409 | -0.428952 |
D | 23.43032 | 0.029935 |
E | -0.754664 | -5.968392 |
F | -521.1214 | -542.8447 |
G | 364.8201 | 417.3879 |
H | -496.2224 | -496.2224 |
Reference | Chase, 1998 | Chase, 1998 |
Comment | Data last reviewed in December, 1976 | Data last reviewed in December, 1976 |

Reaction thermochemistry data

Data compiled by: John E. Bartmess
Individual Reactions
Cl3Si- + =
By formula: Cl3Si- + H+ = HCl3Si
Quantity | Value | Units | Method | Reference | Comment |
---|---|---|---|---|---|
ΔrH° | <1510. ± 10. | kJ/mol | D-EA | Pabst, Margrave, et al., 1977 | gas phase; From SiCl4. G3MP2B3 calculations indicate an EA of ca. 3.0 eV. |
Quantity | Value | Units | Method | Reference | Comment |
ΔrG° | <1478. ± 10. | kJ/mol | H-TS | Pabst, Margrave, et al., 1977 | gas phase; From SiCl4. G3MP2B3 calculations indicate an EA of ca. 3.0 eV. |

Kovats' RI, non-polar column, isothermal

Column type | Active phase | Temperature (C) | I | Reference | Comment |
---|---|---|---|---|---|
Packed | Polymethylsiloxane, (PMS-20000) | 50. | 496.3 | Ainshtein and Shulyatieva, 1972 | He, Chromosorb W; Column length: 2. m |
Packed | SE-30 | 40. | 491. | Garzó, Fekete, et al., 1967 | N2, Chromosorb W; Column length: 2. m |

Phase change data

Data compiled as indicated in comments:
BS - Robert L. Brown and Stephen E. Stein
TRC - Thermodynamics Research Center, NIST Boulder Laboratories, Chris Muzny director
AC - William E. Acree, Jr., James S. Chickos

Quantity Value Units Method Reference Comment
Tboil304. - 305.KN/APCR Inc., 1990BS
Tboil305.0KN/ATaylor and Walten, 1944Uncertainty assigned by TRC = 0.5 K; TRC

Enthalpy of vaporization

ΔvapH (kJ/mol) Temperature (K) Method Reference Comment
24.9314.N/ALapidus, Nisel'son, et al., 1967Based on data from 303. - 325. K.; AC
27.2290.IJenkins and Chambers, 1954Based on data from 275. - 305. K.; AC

Antoine Equation Parameters

log10(P) = A − (B / (T + C))
    P = vapor pressure (bar)
    T = temperature (K)

View plot Requires a JavaScript / HTML 5 canvas capable browser.

Temperature (K) A B C Reference
275.3 - 304.84.216091170.-27.Jenkins and Chambers, 1954

In addition to the Thermodynamics Research Center (TRC) data available from this site, much more physical and chemical property data is available from the following TRC products:

Vibrational and/or electronic energy levels

Data compiled by: Takehiko Shimanouchi

Symmetry:   C     Symmetry Number σ = 3

 Sym.   No   Approximate   Selected Freq.  Infrared   Raman   Comments
 Species   type of mode   Value   Rating   Value  Phase  Value  Phase

a1 1 SiH str 2261  B 2260.9 S gas 2258 p liq.
a1 2 SiCl3 s-str 499  B 498.6 S gas 489 p liq.
a1 3 SiCl3 s-deform 254  B 253.7 M gas 250 p liq.
e 4 SiH bend 811  B 810.8 VS gas 799 dp liq.
e 5 SiCl3 d-str 600  B 600.1 VS gas 587 dp liq.
e 6 SiCl3 d-deform 176  B 175.5 M gas 179 dp liq.

Source: Shimanouchi, 1972

References

Chase, 1998
Chase, M.W., Jr.,
NIST-JANAF Themochemical Tables, Fourth Edition,
J. Phys. Chem. Ref. Data, Monograph 9, 1998, 1-1951. [all data]
Pabst, Margrave, et al., 1977
Pabst, R.E.; Margrave, J.L.; Franklin, J.L.,
Electron impact studies of the tetrachlorides and tetrabromides of silicon and germanium,
Int. J. Mass Spectrom. Ion Phys., 1977, 25, 361. [all data]
Ainshtein and Shulyatieva, 1972
Ainshtein, A.A.; Shulyatieva, T.I.,
Retention indices of alkyl- and arylchlorosilanes,
Zh. Anal. Khim., 1972, 27, 816-821. [all data]
Garzó, Fekete, et al., 1967
Garzó, G.; Fekete, J.; Blazsó, M.,
Determination of the gas chromatographic retention indices of various organometallic compounds,
Acta Chim. Acad. Sci. Hung., 1967, 51, 4, 359-369. [all data]