Benzoic acid, 4-bromo-, 2-acetyl-3-hydroxy-1-methylene-2-butenyl ester, (Z)-
- Formula: C14H13BrO4
- Molecular weight: 325.155
- CAS Registry Number: 100241-75-6

Reaction thermochemistry data

Data compiled by: Hussein Y. Afeefy, Joel F. Liebman, and Stephen E. Stein
Individual Reactions
C14H13BrO4 = C14H13BrO4
By formula: C14H13BrO4 = C14H13BrO4
Quantity | Value | Units | Method | Reference | Comment |
---|---|---|---|---|---|
ΔrH° | 8.03 ± 0.25 | kJ/mol | Eqk | Zhdanov, Olekhnovich, et al., 1985 | solid phase; PMR |

References

Zhdanov, Olekhnovich, et al., 1985
Zhdanov, Yu.A.; Olekhnovich, L.P.; Simakov, V.I.; Furmanova, N.G.; Minkin, V.I.,
Reversible [1,5] acyl and hydrogen sigmatropic shifts in triacetylmethane O-derivatives,
Dokl. Phys. Chem. (Engl. Transl.), 1985, 282, 176-180. [all data]