Ethanol, 2-(octyloxy)-
- Formula: C10H22O2
- Molecular weight: 174.2805
- IUPAC Standard InChIKey: ZQCIMPBZCZUDJM-UHFFFAOYSA-N
- CAS Registry Number: 10020-43-6
- Chemical structure:
View 3d structure (requires JavaScript / HTML 5) - Other names: Ethylene glycol mono-n-octyl ether; 1-(2-Hydroxyethoxy)octane; 2-(Octyloxy)ethanol; Ethylene glycol monooctyl ether; n-Octyl-monooxyethylene

Kovats' RI, non-polar column, isothermal

Column type | Active phase | Temperature (C) | I | Reference | Comment |
---|---|---|---|---|---|
Packed | SE-30 | 170. | 1282. | Voelkel, 1987 | He, Chromaton N Super (75-100 mesh); Column length: 1. m |

References

Voelkel, 1987
Voelkel, A.,
Retention Indices and Thermodynamic Functions of Solution for Model Non-Ionic Surfactants in Standard Stationary Phases Determined by Gas Chromatography,
J. Chromatogr., 1987, 387, 95-104, https://doi.org/10.1016/S0021-9673(01)94516-9
. [all data]