1H-Pyrazole, 3-methyl-5-(trifluoromethyl)-
- Formula: C5H5F3N2
- Molecular weight: 150.1018
- IUPAC Standard InChIKey: DLCHCAYDSKIFIN-UHFFFAOYSA-N
- CAS Registry Number: 10010-93-2
- Chemical structure:
View 3d structure (requires JavaScript / HTML 5) - Other names: Pyrazole, 3-methyl-5-(trifluoromethyl)-; Pyrazole, 3(or 5)-methyl-5(or 3)-(trifluoromethyl)-; 3-Methyl-5-(trifluoromethyl)pyrazole; 3(5)-Trifluoromethyl-5(3)-methylpyrazole

Phase change data

Data compiled by: William E. Acree, Jr., James S. Chickos
Enthalpy of sublimation
ΔsubH (kJ/mol) | Temperature (K) | Method | Reference |
---|---|---|---|
78.2 ± 0.8 | 297. | ME | Elguero, Yranzo, et al., 1991 |

Reaction thermochemistry data

Data compiled by: John E. Bartmess
Individual Reactions
C5H4F3N2- + =
By formula: C5H4F3N2- + H+ = C5H5F3N2
Quantity | Value | Units | Method | Reference | Comment |
---|---|---|---|---|---|
ΔrH° | 1428. ± 8.8 | kJ/mol | G+TS | Taft, 1991 | gas phase |
Quantity | Value | Units | Method | Reference | Comment |
ΔrG° | 1396. ± 8.4 | kJ/mol | IMRE | Taft, 1991 | gas phase |

Gas phase ion energetics data

Data compiled by: John E. Bartmess
De-protonation reactions
C5H4F3N2- + =
By formula: C5H4F3N2- + H+ = C5H5F3N2
Quantity | Value | Units | Method | Reference | Comment |
---|---|---|---|---|---|
ΔrH° | 1428. ± 8.8 | kJ/mol | G+TS | Taft, 1991 | gas phase |
Quantity | Value | Units | Method | Reference | Comment |
ΔrG° | 1396. ± 8.4 | kJ/mol | IMRE | Taft, 1991 | gas phase |

References

Elguero, Yranzo, et al., 1991
Elguero, Jose; Yranzo, Gloria I.; Laynez, Jose; Jimenez, Pilar; Menendez, Margarita; Catalan, Javier; De Paz, Jose Luis G.; Anvia, Frederick; Taft, Robert W.,
Effect of the replacement of a methyl by a trifluoromethyl group on the acid-base properties of pyrazoles,
J. Org. Chem., 1991, 56, 12, 3942-3947, https://doi.org/10.1021/jo00012a030
. [all data]
Taft, 1991
Taft, R.W.,
, personal communication, Aug, 1991. [all data]