dihydro-5-methylenefuran-2(3H)-one
- Formula: C5H6O2
- Molecular weight: 98.0999
- IUPAC Standard InChIKey: SIFBVNDLLGPEKT-UHFFFAOYSA-N
- CAS Registry Number: 10008-73-8
- Chemical structure:
View 3d structure (requires JavaScript / HTML 5) - Species with the same structure:
- Other names: Gamma-methylene-gamma-butyrolactone

Phase change data

Data compiled by: Robert L. Brown and Stephen E. Stein
Reduced pressure boiling point
Tboil (K) | Pressure (bar) | Reference |
---|---|---|
353.2 | 0.023 | Aldrich Chemical Company Inc., 1990 |

Reaction thermochemistry data

Data compiled by: Hussein Y. Afeefy, Joel F. Liebman, and Stephen E. Stein
Individual Reactions
By formula: C5H6O2 = C5H6O2
Quantity | Value | Units | Method | Reference | Comment |
---|---|---|---|---|---|
ΔrH° | -8.5 ± 1.1 | kJ/mol | Kin | Taskinen, 1994 | liquid phase; solvent: Cyclohexane |

References

Aldrich Chemical Company Inc., 1990
Aldrich Chemical Company Inc.,
Catalog Handbook of Fine Chemicals, Aldrich Chemical Company, Inc., Milwaukee WI, 1990, 1. [all data]
Taskinen, 1994
Taskinen, E.,
Relative thermodynamic stabilities of γ-methylene-γ-butyrolactone and α-angelicalactone,
Tetrahedron, 1994, 50, 1885-1888. [all data]