RhF4 anion

Gas phase ion energetics data

Data compiled by: John E. Bartmess

Electron affinity of neutral species

EAneutral (eV) Method Reference Comment
5.43 ± 0.28TDEqKuznetsov, Korobov, et al., 1989RuF4- + RhF4 <=> RhF4- + RuF4, ΔH = -15.7±2.8 kcal/mol.
5.00 ± 0.20R-AChilingarov, Korobov, et al., 1984Fluoride Affinity: 5.3 kcal <MnF3

References

Kuznetsov, Korobov, et al., 1989
Kuznetsov, S.V.; Korobov, M.V.; Sidorov, L.N.; Savinova, L.N.; Shipachev, V.A.; Mit'kin, V.N., Gas Phase Negative Ions of Platinum Metal Fluorides. I. Electron Affinity of Platinum Metal Tetrafluorides, Int. J. Mass Spectrom. Ion Proc., 1989, 87, 1, 1, https://doi.org/10.1016/0168-1176(89)80001-1 . [all data]

Chilingarov, Korobov, et al., 1984
Chilingarov, N.S.; Korobov, M.V.; Sidirov, L.N.; Mitkin, V.N.; Shipachev, V.A.; Zemskov, S.V., Electron affinity of rhodium tetrafluoride, J. Chem. Thermodyn., 1984, 16, 965. [all data]