CH2=C=NO2 anion
- Formula: C2H2NO2-
- Molecular weight: 72.0433

Reaction thermochemistry data

Data compiled by: John E. Bartmess
Individual Reactions
By formula: C2H2NO2- + H+ = C2H3NO2
Quantity | Value | Units | Method | Reference | Comment |
---|---|---|---|---|---|
ΔrH° | 1515. ± 19. | kJ/mol | EIAE | Shiga, Yamaoka, et al., 1972 | gas phase; From CH2=CHNO2 |
ΔrH° | <1563.1 | kJ/mol | G+TS | Bartmess, 1980 | gas phase |
Quantity | Value | Units | Method | Reference | Comment |
ΔrG° | 1483. ± 22. | kJ/mol | H-TS | Shiga, Yamaoka, et al., 1972 | gas phase; From CH2=CHNO2 |
ΔrG° | <1531.3 | kJ/mol | IMRB | Bartmess, 1980 | gas phase |

Gas phase ion energetics data

Data compiled by: John E. Bartmess
Protonation reactions
By formula: C2H2NO2- + H+ = C2H3NO2
Quantity | Value | Units | Method | Reference | Comment |
---|---|---|---|---|---|
ΔrH° | 1515. ± 19. | kJ/mol | EIAE | Shiga, Yamaoka, et al., 1972 | gas phase; From CH2=CHNO2 |
ΔrH° | <1563.1 | kJ/mol | G+TS | Bartmess, 1980 | gas phase |
Quantity | Value | Units | Method | Reference | Comment |
ΔrG° | 1483. ± 22. | kJ/mol | H-TS | Shiga, Yamaoka, et al., 1972 | gas phase; From CH2=CHNO2 |
ΔrG° | <1531.3 | kJ/mol | IMRB | Bartmess, 1980 | gas phase |

References

Shiga, Yamaoka, et al., 1972
Shiga, T.; Yamaoka, H.; Arakawa, K.; Suguira, T.,
A negative ion-molecule reaction in nitroethylene,
Bull. Chem. Soc. Jpn., 1972, 45, 2065. [all data]
Bartmess, 1980
Bartmess, J.E.,
Solvent effects on ion-molecule reactions. Vinyl anions vs. conjugate addition,
J. Am. Chem. Soc., 1980, 102, 2483. [all data]