1,3,5-Triazine anion
- Formula: C3H3N3-
- Molecular weight: 81.0766

Gas phase thermochemistry data

Data compiled by: John E. Bartmess
Quantity | Value | Units | Method | Reference | Comment |
---|---|---|---|---|---|
ΔfH°gas | 182.5 | kJ/mol | R-EA | Nenner and Schultz, 1975 | G3MP2B3 calculations indicate an EA of ca. 0.1 eV |

References

Nenner and Schultz, 1975
Nenner, I.; Schultz, G.J.,
Temporary negative ions and electron affinities of benzene and N-heterocyclic molecules: Pyridine, pyridazine, pyrimidine, pyrazine, and s-triazine,
J. Chem. Phys., 1975, 62, 1747. [all data]