5,5-diMe-1,3-dithianide anion
- Formula: C6H11S2-
- Molecular weight: 147.282

Gas phase ion energetics data

Data compiled by: John E. Bartmess
Protonation reactions
C6H11S2- + = C6H12S2
By formula: C6H11S2- + H+ = C6H12S2
Quantity | Value | Units | Method | Reference | Comment |
---|---|---|---|---|---|
ΔrH° | 1565. ± 8.8 | kJ/mol | G+TS | Bartmess, Hays, et al., 1981 | gas phase; value altered from reference due to change in acidity scale |
Quantity | Value | Units | Method | Reference | Comment |
ΔrG° | 1535. ± 8.4 | kJ/mol | IMRE | Bartmess, Hays, et al., 1981 | gas phase; value altered from reference due to change in acidity scale |

Ion clustering data

Data compiled by: John E. Bartmess
Clustering reactions
By formula: C6H11S2- + CH4O = (C6H11S2- • CH4O)
Quantity | Value | Units | Method | Reference | Comment |
---|---|---|---|---|---|
ΔrH° | 92. ± 10. | kJ/mol | N/A | Caldwell, Rozeboom, et al., 1984 | gas phase; Reanchored to average data from Paul and Kebarle, 1990 and Meot-ner and Sieck, 1986.; value altered from reference due to change in acidity scale |
Quantity | Value | Units | Method | Reference | Comment |
ΔrG° | 55.2 ± 6.7 | kJ/mol | IMRE | Caldwell, Rozeboom, et al., 1984 | gas phase; Reanchored to average data from Paul and Kebarle, 1990 and Meot-ner and Sieck, 1986.; value altered from reference due to change in acidity scale |

References

Bartmess, Hays, et al., 1981
Bartmess, J.E.; Hays, R.L.; Khatri, H.N.; Misra, R.N.; Wilson, S.W.,
Elimination, fragmentation and proton transfer in 1,3-dithianes and 1,3-dithiolanes in the gas phase,
J. Am. Chem. Soc., 1981, 103, 4746. [all data]
Caldwell, Rozeboom, et al., 1984
Caldwell, G.; Rozeboom, M.D.; Kiplinger, J.P.; Bartmess, J.E.,
Anion-alcohol hydrogen bond strengths in the gas phase,
J. Am. Chem. Soc., 1984, 106, 4660. [all data]
Paul and Kebarle, 1990
Paul, G.J.C.; Kebarle, P.,
Thermodynamics of the Association Reactions OH- - H2O = HOHOH- and CH3O- - CH3OH = CH3OHOCH3- in the Gas Phase,
J. Phys. Chem., 1990, 94, 12, 5184, https://doi.org/10.1021/j100375a076
. [all data]
Meot-ner and Sieck, 1986
Meot-ner, M.; Sieck, L.W.,
Relative acidities of water and methanol, and the stabilities of the dimer adducts,
J. Phys. Chem., 1986, 90, 6687. [all data]