NCCðCCðC anion
- Formula: C5N-
- Molecular weight: 74.0607

Reaction thermochemistry data

Data compiled by: John E. Bartmess
Individual Reactions
C5N- + = C5HN
Quantity | Value | Units | Method | Reference | Comment |
---|---|---|---|---|---|
ΔrH° | 1439. ± 21. | kJ/mol | D-EA | Yen, Garand, et al., 2010 | gas phase |
ΔrH° | 1647. ± 21. | kJ/mol | D-EA | Dibeler, Reese, et al., 1961 | gas phase; From HC≡C-(C≡C)2-C≡N. The derived acidity is ca. 40 kcal/mol too weak, based on homologs. |

Gas phase ion energetics data

Data compiled by: John E. Bartmess
Electron affinity of neutral species
EAneutral (eV) | Method | Reference | Comment |
---|---|---|---|
4.450 ± 0.030 | LPES | Yen, Garand, et al., 2010 | |
2.29999 | EIAE | Dibeler, Reese, et al., 1961 | From HC≡C-(C≡C)2-C≡N. The derived acidity is ca. 40 kcal/mol too weak, based on homologs. |
Protonation reactions
C5N- + = C5HN
Quantity | Value | Units | Method | Reference | Comment |
---|---|---|---|---|---|
ΔrH° | 1439. ± 21. | kJ/mol | D-EA | Yen, Garand, et al., 2010 | gas phase |
ΔrH° | 1647. ± 21. | kJ/mol | D-EA | Dibeler, Reese, et al., 1961 | gas phase; From HC≡C-(C≡C)2-C≡N. The derived acidity is ca. 40 kcal/mol too weak, based on homologs. |

References

Yen, Garand, et al., 2010
Yen, T.A.; Garand, E.; Shreve, A.T.; Neumark, D.M.,
Anion Photoelectron Spectroscopy of C3N- and C5N-,
J. Phys. Chem. A, 2010, 114, 9, 3215-3220, https://doi.org/10.1021/jp9093996
. [all data]
Dibeler, Reese, et al., 1961
Dibeler, V.H.; Reese, R.M.; Franklin, J.L.,
Mass spectrometric study of cyanogen and cyanoacetylenes,
J. Am. Chem. Soc., 1961, 83, 1813. [all data]