Me2C(NO)CH2 anion
- Formula: C4H8NO-
- Molecular weight: 86.1130

Reaction thermochemistry data

Data compiled by: John E. Bartmess
Individual Reactions
By formula: C4H8NO- + H+ = C4H9NO
Quantity | Value | Units | Method | Reference | Comment |
---|---|---|---|---|---|
ΔrH° | 385.4 ± 6.1 | kcal/mol | G+TS | Noest and Nibbering, 1980 | gas phase; Between H2O, MeOH |
Quantity | Value | Units | Method | Reference | Comment |
ΔrG° | 379.0 ± 6.0 | kcal/mol | IMRB | Noest and Nibbering, 1980 | gas phase; Between H2O, MeOH |

Gas phase ion energetics data

Data compiled by: John E. Bartmess
Protonation reactions
By formula: C4H8NO- + H+ = C4H9NO
Quantity | Value | Units | Method | Reference | Comment |
---|---|---|---|---|---|
ΔrH° | 385.4 ± 6.1 | kcal/mol | G+TS | Noest and Nibbering, 1980 | gas phase; Between H2O, MeOH |
Quantity | Value | Units | Method | Reference | Comment |
ΔrG° | 379.0 ± 6.0 | kcal/mol | IMRB | Noest and Nibbering, 1980 | gas phase; Between H2O, MeOH |

References

Noest and Nibbering, 1980
Noest, A.J.; Nibbering, N.M.M.,
Homoconjugation vs. charge dipole stabilization interaction effects in the stabilization of carbanions in the gas phase,
J. Am. Chem. Soc., 1980, 102, 6427. [all data]