F2C=C=O radical anion

Gas phase thermochemistry data

Data compiled by: John E. Bartmess

Quantity Value Units Method Reference Comment
Δfgas-150. ± 59.kJ/molEIAEHarland and Thynne, 1975From CF3CHO. G3MP2B3 calculations indicate an EA of ca. 0.9 eV

References

Harland and Thynne, 1975
Harland, P.W.; Thynne, J.C.J., Dissociative eElectron cCapture in tTrifluoroacetaldehyde, pentafluoropropionaldehyde, and heptafluorobutyraldehyde, Int. J. Mass Spectrom. Ion Phys., 1975, 18, 73. [all data]