FeF3..FeF4 anion
- Formula: F7Fe2-
- Molecular weight: 244.679

Reaction thermochemistry data

Data compiled by: John E. Bartmess
Individual Reactions
By formula: F4Fe- + F3Fe = F7Fe2-
Quantity | Value | Units | Method | Reference | Comment |
---|---|---|---|---|---|
ΔrH° | 189. ± 24. | kJ/mol | TDAs | Sidirov, Borshchevsky, et al., 1986 | gas phase; value altered from reference due to conversion from electron convention to ion convention |
ΔrH° | 204. ± 4.2 | kJ/mol | TDAs | Sorokin, Sidorov, et al., 1981 | gas phase; ΔHf(A-) at 0 K; value altered from reference due to conversion from electron convention to ion convention |

Gas phase ion energetics data

Data compiled by: John E. Bartmess
Electron affinity of neutral species
EAneutral (eV) | Method | Reference | Comment |
---|---|---|---|
4.45 ± 0.24 | R-A | Sidirov, Borshchevsky, et al., 1986 | value altered from reference due to conversion from electron convention to ion convention |

Ion clustering data

Data compiled by: John E. Bartmess
Clustering reactions
By formula: F4Fe- + F3Fe = F7Fe2-
Quantity | Value | Units | Method | Reference | Comment |
---|---|---|---|---|---|
ΔrH° | 189. ± 24. | kJ/mol | TDAs | Sidirov, Borshchevsky, et al., 1986 | gas phase; value altered from reference due to conversion from electron convention to ion convention |
ΔrH° | 204. ± 4.2 | kJ/mol | TDAs | Sorokin, Sidorov, et al., 1981 | gas phase; ΔHf(A-) at 0 K; value altered from reference due to conversion from electron convention to ion convention |

Gas phase thermochemistry data

Data compiled by: John E. Bartmess
Quantity | Value | Units | Method | Reference | Comment |
---|---|---|---|---|---|
ΔfH°gas | -567.1 ± 8.8 | kcal/mol | Ther | Sidirov, Borshchevsky, et al., 1986 | value altered from reference due to conversion from electron convention to ion convention |

References

Sidirov, Borshchevsky, et al., 1986
Sidirov, L.N.; Borshchevsky, A.Ya.; Boltalina, O.V.; Sorokin, I.D.; Skokan, E.V.,
Electron affinities of gaseous iron fluorides and dimers,
Int. J. Mass Spectrom. Ion Processes, 1986, 73, 1. [all data]
Sorokin, Sidorov, et al., 1981
Sorokin, I.D.; Sidorov, L.N.; Nikitin, M.I.; Skokan, E.V.,
Mass-spectrometric determination of the enthalpies of dissociation of gaseous complex fluorides into neutral and charged particles. V. Heats of formation of FeF3- and FeF4-,
Int. J. Mass Spectrom. Ion Phys., 1981, 41, 45. [all data]