CO2..HO anion
- Formula: CHO3-
- Molecular weight: 61.0174

Gas phase thermochemistry data

Data compiled by: John E. Bartmess
Quantity | Value | Units | Method | Reference | Comment |
---|---|---|---|---|---|
ΔfH°gas | -745.21 | kJ/mol | Ther | Squires, 1992 | Dissociative protonation threshold at nPrSH, 9 kcal> calc. CIDC(HOCO2-..HSH) = 7:1 HOCO2- |

Gas phase ion energetics data

Data compiled by: John E. Bartmess
Electron affinity of neutral species
EAneutral (eV) | Method | Reference | Comment |
---|---|---|---|
3.680 ± 0.015 | LPES | Wang and Xantheas, 2011 | |
3.98993 | D-EA | Squires, 1992 | Dissociative protonation threshold at nPrSH, 9 kcal> calc. CIDC(HOCO2-..HSH) = 7:1 HOCO2- |

Ion clustering data

Data compiled by: John E. Bartmess
Clustering reactions
CHO3- + = CH3O4-
By formula: CHO3- + H2O = CH3O4-
Quantity | Value | Units | Method | Reference | Comment |
---|---|---|---|---|---|
ΔrH° | 65.69 ± 0.84 | kJ/mol | TDAs | Keesee, Lee, et al., 1979 | gas phase |
Quantity | Value | Units | Method | Reference | Comment |
ΔrG° | 35.6 ± 1.7 | kJ/mol | TDAs | Keesee, Lee, et al., 1979 | gas phase |

References

Squires, 1992
Squires, R.R.,
Gas Phase Thermochemical Properties of the Bicarbonate and Bisulfate Ions,
Int. J. Mass Spectrom. Ion Proc., 1992, 117, 565, https://doi.org/10.1016/0168-1176(92)80114-G
. [all data]
Wang and Xantheas, 2011
Wang, X.B.; Xantheas, S.S.,
Photodetachment of Isolated Bicarbonate Anion: Electron Binding Energy of HCO3-,
J. Phys. Chem. Lett., 2011, 2, 10, 1204-1210, https://doi.org/10.1021/jz200327f
. [all data]
Keesee, Lee, et al., 1979
Keesee, R.G.; Lee, N.; Castleman Jr.,
Properties of Clusters in the Gas Phase. 3. Hydration Complexes of CO3- and HCO3-,
J. Am. Chem. Soc., 1979, 101, 10, 2599, https://doi.org/10.1021/ja00504a015
. [all data]