Br3C anion

Reaction thermochemistry data

Data compiled by: John E. Bartmess

Individual Reactions

CBr3- + Hydrogen cation = Methane, tribromo-

By formula: CBr3- + H+ = CHBr3

Quantity Value Units Method Reference Comment
Δr1463. ± 9.2kJ/molG+TSBorn, Ingemann, et al., 2000gas phase
Quantity Value Units Method Reference Comment
Δr1431. ± 8.4kJ/molIMREBorn, Ingemann, et al., 2000gas phase

References

Born, Ingemann, et al., 2000
Born, M.; Ingemann, S.; Nibbering, N.M.M., Thermochemical properties of halogen-substituted methanes, methyl radicals, and carbenes in the gas phase, Int. J. Mass Spectrom., 2000, 194, 2-3, 103-113, https://doi.org/10.1016/S1387-3806(99)00125-6 . [all data]