AlO2 anion
- Formula: AlO2-
- Molecular weight: 58.9809

Gas phase ion energetics data

Data compiled by: John E. Bartmess
Protonation reactions
AlO2- + = HAlO2
By formula: AlO2- + H+ = HAlO2
Quantity | Value | Units | Method | Reference | Comment |
---|---|---|---|---|---|
ΔrH° | 1440. ± 130. | kJ/mol | D-EA | Desai, Wu, et al., 1996 | gas phase |

Gas phase thermochemistry data

Data compiled by: John E. Bartmess
Quantity | Value | Units | Method | Reference | Comment |
---|---|---|---|---|---|
ΔfH°gas | -450. ± 130. | kJ/mol | R-EA | Desai, Wu, et al., 1996 |

Reaction thermochemistry data

Data compiled by: John E. Bartmess
Individual Reactions
AlO2- + = HAlO2
By formula: AlO2- + H+ = HAlO2
Quantity | Value | Units | Method | Reference | Comment |
---|---|---|---|---|---|
ΔrH° | 344. ± 32. | kcal/mol | D-EA | Desai, Wu, et al., 1996 | gas phase |

References

Desai, Wu, et al., 1996
Desai, S.R.; Wu, H.; Wang, L.-S.,
Vibrationally Resolved Photoelectron Spectroscopy of AlO- and AlO2-,
Int. J. Mass Spectrom. Ion Proc., 1996, 159, 1-3, 75, https://doi.org/10.1016/S0168-1176(96)04443-6
. [all data]