cyclopropanide anion

Reaction thermochemistry data

Data compiled by: John E. Bartmess

Individual Reactions

C3H5- + Hydrogen cation = Cyclopropane

By formula: C3H5- + H+ = C3H6

Quantity Value Units Method Reference Comment
Δr1716. ± 10.kJ/molAVGN/AAverage of 5 out of 7 values; Individual data points
Quantity Value Units Method Reference Comment
Δr1676. ± 10.kJ/molAVGN/AAverage of 3 out of 6 values; Individual data points

References

No reference data available.