Me2C(CH=CH)2BCH2 anion
- Formula: C8H12B-
- Molecular weight: 118.992

Reaction thermochemistry data

Data compiled by: John E. Bartmess
Individual Reactions
C8H12B- + = C8H13B
By formula: C8H12B- + H+ = C8H13B
Quantity | Value | Units | Method | Reference | Comment |
---|---|---|---|---|---|
ΔrH° | 1544. ± 17. | kJ/mol | G+TS | Sullivan, 1977 | gas phase |
Quantity | Value | Units | Method | Reference | Comment |
ΔrG° | 1515. ± 17. | kJ/mol | IMRB | Sullivan, 1977 | gas phase |

Gas phase ion energetics data

Data compiled by: John E. Bartmess
Protonation reactions
C8H12B- + = C8H13B
By formula: C8H12B- + H+ = C8H13B
Quantity | Value | Units | Method | Reference | Comment |
---|---|---|---|---|---|
ΔrH° | 1544. ± 17. | kJ/mol | G+TS | Sullivan, 1977 | gas phase |
Quantity | Value | Units | Method | Reference | Comment |
ΔrG° | 1515. ± 17. | kJ/mol | IMRB | Sullivan, 1977 | gas phase |

References

Sullivan, 1977
Sullivan, S.A.,
Thesis, Cal. Inst. Tech. thesis,, 1977. [all data]