C2F3 anion
- Formula: C2F3-
- Molecular weight: 81.0172

Gas phase ion energetics data

Data compiled by: John E. Bartmess
Protonation reactions
By formula: C2F3- + H+ = C2HF3
Quantity | Value | Units | Method | Reference | Comment |
---|---|---|---|---|---|
ΔrH° | 1630. ± 24. | kJ/mol | D-EA | Spyrou, Sauers, et al., 1983 | gas phase; From C3F8. G3MP2B3 calculations indicate an EA of ca. 2.4 eV, and HOF(A-) of -110 kcal/mol. |

References

Spyrou, Sauers, et al., 1983
Spyrou, S.M.; Sauers, I.; Christophorou, L.G.,
Electron attachment to the perfluoroalkanes n-CnF2n+2 (n = 1-6) and i-C4F10,
J. Chem. Phys., 1983, 78, 7200. [all data]