PtAl anion

Gas phase ion energetics data

Data compiled by: John E. Bartmess

Electron affinity of neutral species

EAneutral (eV) Method Reference Comment
2.100 ± 0.050LPESZhang, Gantefor, et al., 2014Stated electron affinity is the Vertical Detachment Energy

References

Zhang, Gantefor, et al., 2014
Zhang, X.X.; Gantefor, G.; Bowen, K.H.; Alexandrova, A.N., The PtAl- and PtAl2- anions: Theoretical and photoelectron spectroscopic characterization, Journal Of Chemical Physics, 2014, 140, 16, 164316, https://doi.org/10.1063/1.4873160 . [all data]