tBuCðC anion
- Formula: C6H9-
- Molecular weight: 81.1362

Gas phase ion energetics data

Data compiled by: John E. Bartmess
Electron affinity of neutral species
EAneutral (eV) | Method | Reference | Comment |
---|---|---|---|
2.98 ± 0.24 | D-EA | Bartmess, Scott, et al., 1979 | value altered from reference due to change in acidity scale |
Protonation reactions
By formula: C6H9- + H+ = C6H10
Quantity | Value | Units | Method | Reference | Comment |
---|---|---|---|---|---|
ΔrH° | 378.0 ± 2.2 | kcal/mol | G+TS | Bartmess, Scott, et al., 1979 | gas phase; value altered from reference due to change in acidity scale |
Quantity | Value | Units | Method | Reference | Comment |
ΔrG° | 370.2 ± 2.0 | kcal/mol | IMRE | Bartmess, Scott, et al., 1979 | gas phase; value altered from reference due to change in acidity scale |

Ion clustering data

Data compiled by: John E. Bartmess
Clustering reactions
C6H9- + = C7H13O-
By formula: C6H9- + CH4O = C7H13O-
Quantity | Value | Units | Method | Reference | Comment |
---|---|---|---|---|---|
ΔrH° | 20.8 ± 2.0 | kcal/mol | IMRE | Chabinyc and Brauman, 1999 | gas phase; Anchored to MeOH ΔGacid=375.2 |
Quantity | Value | Units | Method | Reference | Comment |
ΔrG° | 11.50 | kcal/mol | IMRE | Mustanir, Matsuoka, et al., 2006 | gas phase |
ΔrG° | 10.7 ± 2.0 | kcal/mol | IMRE | Chabinyc and Brauman, 1999 | gas phase; Anchored to MeOH ΔGacid=375.2 |

Reaction thermochemistry data

Data compiled by: John E. Bartmess

Individual Reactions

C6H9- + Methyl Alcohol = C7H13O-

By formula: C6H9- + CH4O = C7H13O-

Quantity Value Units Method Reference Comment
Δr20.8 ± 2.0kcal/molIMREChabinyc and Brauman, 1999gas phase; Anchored to MeOH ΔGacid=375.2
Quantity Value Units Method Reference Comment
Δr11.50kcal/molIMREMustanir, Matsuoka, et al., 2006gas phase
Δr10.7 ± 2.0kcal/molIMREChabinyc and Brauman, 1999gas phase; Anchored to MeOH ΔGacid=375.2

C6H9- + Hydrogen cation = 1-Butyne, 3,3-dimethyl-

By formula: C6H9- + H+ = C6H10

Quantity Value Units Method Reference Comment
Δr378.0 ± 2.2kcal/molG+TSBartmess, Scott, et al., 1979gas phase; value altered from reference due to change in acidity scale
Quantity Value Units Method Reference Comment
Δr370.2 ± 2.0kcal/molIMREBartmess, Scott, et al., 1979gas phase; value altered from reference due to change in acidity scale

References

Bartmess, Scott, et al., 1979
Bartmess, J.E.; Scott, J.A.; McIver, R.T., Jr.,
The gas phase acidity scale from methanol to phenol,
J. Am. Chem. Soc., 1979, 101, 6047. [all data]
Chabinyc and Brauman, 1999
Chabinyc, M.L.; Brauman, J.I.,
Hydrogen bond strength and acidity. Structural and energetic correlations for acetylides and alcohols,
J. Phys. Chem. A, 1999, 103, 46, 9163-9166, https://doi.org/10.1021/jp992852v
. [all data]
Mustanir, Matsuoka, et al., 2006
Mustanir; Matsuoka, M.; Mishima, M.; Koch, H.,
Stability of complexes of phenylacetylides and benzyl alkoxides with methanol in the gas phase. Acid-base correlation in the ionic hydrogen-bond strength,
Bull. Chem. Soc. Japan, 2006, 79, 7, 1118-1125, https://doi.org/10.1246/bcsj.79.1118
. [all data]