AuB2O3 radical anion

Gas phase ion energetics data

Data compiled by: John E. Bartmess

Electron affinity of neutral species

EAneutral (eV) Method Reference Comment
6.050 ± 0.080LPESTian, Xu, et al., 2014Vertical Detachment Energy: 6.17±0.08 eV

References

Tian, Xu, et al., 2014
Tian, W.J.; Xu, H.G.; Kong, X.Y.; Chen, Q.; Zheng, W.J.; Zhai, H.J.; Li, S.D., Photoelectron spectroscopy of lithium and gold alloyed boron oxide clusters: charge transfer complexes, covalent gold, hyperhalogen, and dual three-center four-electron hyperbonds, Phys. Chem. Chem. Phys., 2014, 16, 11, 5129-5136, https://doi.org/10.1039/c3cp55362k . [all data]