3,5-diMe-2-OH-C6H2CH2C(SO2CF3)2 anion

Reaction thermochemistry data

Data compiled by: John E. Bartmess

Individual Reactions

C12H11F6O5S2- + Hydrogen cation = C12H12F6O5S2

By formula: C12H11F6O5S2- + H+ = C12H12F6O5S2

Quantity Value Units Method Reference Comment
Δr1233.4kJ/molIMREZhang, Badal, et al., 2013gas phase

References

Zhang, Badal, et al., 2013
Zhang, M.; Badal, M.M.R.; Koppel, I.A.; Mishima, M., Gas-Phase Acidities of alpha- and alpha,alpha-SO2CF3-Substituted Toluenes. Varying Resonance Demand in the Electron-Rich System, Bull. Chem. Soc. Japan, 2013, 86, 7, 813-820, https://doi.org/10.1246/bcsj.20130052 . [all data]