pHO2CCH=CH,oOH-C6H3O anion
- Formula: C9H7O4-
- Molecular weight: 179.1500

Gas phase ion energetics data

Data compiled by: John E. Bartmess
Protonation reactions
C9H7O4- + = C9H8O4
By formula: C9H7O4- + H+ = C9H8O4
Quantity | Value | Units | Method | Reference | Comment |
---|---|---|---|---|---|
ΔrH° | 323.4 ± 2.3 | kcal/mol | G+TS | Guerrero, Baer, et al., 2013 | gas phase |
Quantity | Value | Units | Method | Reference | Comment |
ΔrG° | 317.3 ± 2.2 | kcal/mol | CIDC | Guerrero, Baer, et al., 2013 | gas phase |

References

Guerrero, Baer, et al., 2013
Guerrero, A.; Baer, T.; Chana, A.; Gonzalez, J.; Davalos, J.Z.,
Gas Phase Acidity Measurement of Local Acidic Groups in Multifunctional Species: Controlling the Binding Sites in Hydroxycinnamic Acids,
J. Am. Chem. Soc., 2013, 135, 26, 9681-9690, https://doi.org/10.1021/ja400571r
. [all data]