nC6H14..Cl anion
- Formula: C6H14Cl-
- Molecular weight: 121.629

Reaction thermochemistry data

Data compiled by: John E. Bartmess
Individual Reactions
By formula: Cl- = C6H14Cl-
Quantity | Value | Units | Method | Reference | Comment |
---|---|---|---|---|---|
ΔrH° | 42.59 | kJ/mol | N/A | Ziegler, Gamble, et al., 2013 | gas phase |
Quantity | Value | Units | Method | Reference | Comment |
ΔrG° | 13.4 | kJ/mol | N/A | Ziegler, Gamble, et al., 2013 | gas phase |

Ion clustering data

Data compiled by: John E. Bartmess
Clustering reactions
By formula: Cl- = C6H14Cl-
Quantity | Value | Units | Method | Reference | Comment |
---|---|---|---|---|---|
ΔrH° | 42.59 | kJ/mol | N/A | Ziegler, Gamble, et al., 2013 | gas phase |
Quantity | Value | Units | Method | Reference | Comment |
ΔrG° | 13.4 | kJ/mol | N/A | Ziegler, Gamble, et al., 2013 | gas phase |

References

Ziegler, Gamble, et al., 2013
Ziegler, B.E.; Gamble, T.N.; Li, C.; McMahon, T.B.,
Weak Ion-Molecule Interactions in the Gas Phase: A High-Pressure Mass Spectrometry and Computational Study of Chloride-Alkane Interactions,
J. Phys. Chem. A, 2013, 117, 28, 5785-5793, https://doi.org/10.1021/jp403422q
. [all data]