4-CO2Et-bicyclo[2.2.2]octane-CO2 anion
- Formula: C12H17O4-
- Molecular weight: 225.2615

Reaction thermochemistry data

Data compiled by: John E. Bartmess
Individual Reactions
C12H17O4- + = C12H18O4
By formula: C12H17O4- + H+ = C12H18O4
Quantity | Value | Units | Method | Reference | Comment |
---|---|---|---|---|---|
ΔrG° | 334.0 ± 2.0 | kcal/mol | IMRE | Taft and Topsom, 1987 | gas phase; value altered from reference due to change in acidity scale |

Gas phase ion energetics data

Data compiled by: John E. Bartmess
Protonation reactions
C12H17O4- + = C12H18O4
By formula: C12H17O4- + H+ = C12H18O4
Quantity | Value | Units | Method | Reference | Comment |
---|---|---|---|---|---|
ΔrG° | 334.0 ± 2.0 | kcal/mol | IMRE | Taft and Topsom, 1987 | gas phase; value altered from reference due to change in acidity scale |

References

Taft and Topsom, 1987
Taft, R.W.; Topsom, R.D.,
The Nature and Analysis of Substituent Effects,
Prog. Phys. Org. Chem., 1987, 16, 1. [all data]